BDBM50421187 CHEMBL2086801
SMILES: CCOc1c(C(=O)NCCN2CCCC2)n(C)c2c1c(=O)n(CC(=O)c1ccccc1)c1ccccc21
InChI Key: InChIKey=SBRCZBFNAFQHCR-UHFFFAOYSA-N
Data: 1 IC50
Activity Spreadsheet -- Enzyme Inhibition Constant Data from BindingDB
Found 1 hit for monomerid = 50421187
Trg + Lig
Ki
nM
ΔG°
kcal/mole
IC50
nM
Kd
nM
EC50/IC50
nM
koff
s-1
kon
M-1s-1
pHTemp
°C
Sonic hedgehog protein
(Mus musculus (Mouse))
BDBM50421187
(CHEMBL2086801)
Show SMILES CCOc1c(C(=O)NCCN2CCCC2)n(C)c2c1c(=O)n(CC(=O)c1ccccc1)c1ccccc21
Show InChI InChI=1S/C29H32N4O4/c1-3-37-27-24-25(31(2)26(27)28(35)30-15-18-32-16-9-10-17-32)21-13-7-8-14-22(21)33(29(24)36)19-23(34)20-11-5-4-6-12-20/h4-8,11-14H,3,9-10,15-19H2,1-2H3,(H,30,35)
n/an/a 7n/an/an/an/an/an/a
Takeda Pharmaceutical Company Limited
Curated by ChEMBL
Assay Description
Inhibition of recombinant mouse Shh expressed in human NIH/3T3 cells assessed as inhibition of Gli1 expression after 48 hrs by luciferase reporter ge...
Bioorg Med Chem 20: 5496-506 (2012)
Article DOI: 10.1016/j.bmc.2012.07.039
BindingDB Entry DOI: 10.7270/Q2N017TJ