BDBM50421345 E101a::RIBOFLAVIN 5'-PHOSPHATE::Riboflavin 5''-Phosphate
SMILES: Cc1cc2nc3c(nc(=O)[nH]c3=O)n(C[C@H](O)[C@H](O)[C@H](O)COP(O)(O)=O)c2cc1C
InChI Key: InChIKey=FVTCRASFADXXNN-SCRDCRAPSA-N
Data: 1 Kd
PDB links: 1384 PDB IDs match this monomer.
Activity Spreadsheet -- Enzyme Inhibition Constant Data from BindingDB
Found 1 hit for monomerid = 50421345
Trg + Lig
Ki
nM
ΔG°
kcal/mole
IC50
nM
Kd
nM
EC50/IC50
nM
koff
s-1
kon
M-1s-1
pHTemp
°C
Chorismate synthase
(Streptococcus pneumoniae)
BDBM50421345
(E101a | RIBOFLAVIN 5'-PHOSPHATE | Riboflavin 5''-P...)
Show SMILES Cc1cc2nc3c(nc(=O)[nH]c3=O)n(C[C@H](O)[C@H](O)[C@H](O)COP(O)(O)=O)c2cc1C
Show InChI InChI=1S/C17H21N4O9P/c1-7-3-9-10(4-8(7)2)21(15-13(18-9)16(25)20-17(26)19-15)5-11(22)14(24)12(23)6-30-31(27,28)29/h3-4,11-12,14,22-24H,5-6H2,1-2H3,(H,20,25,26)(H2,27,28,29)/t11-,12+,14-/m0/s1
n/an/an/a>2.00E+4n/an/an/an/an/a
TBA
Curated by ChEMBL
Assay Description
Compound was evaluated for the binding affinity towards Escherichia coli chorismate synthase
Bioorg Med Chem Lett 3: 1409-1414 (1993)
Article DOI: 10.1016/S0960-894X(01)80421-2
BindingDB Entry DOI: 10.7270/Q2QN67ZD
3D
3D Structure (crystal)