BDBM50421446 CHEMBL67254
SMILES: CCOC(\C=C\c1ccc(cc1)C(N)=N)C(C)(C)C(=O)N1CCC(CC(O)=O)CC1
InChI Key: InChIKey=USZGOYYRRHVNAB-JXMROGBWSA-N
Data: 1 IC50
Activity Spreadsheet -- Enzyme Inhibition Constant Data from BindingDB
Found 1 hit for monomerid = 50421446
Trg + Lig
Ki
nM
ΔG°
kcal/mole
IC50
nM
Kd
nM
EC50/IC50
nM
koff
s-1
kon
M-1s-1
pHTemp
°C
Integrin alpha-IIb/beta-3
(Homo sapiens (Human))
BDBM50421446
(CHEMBL67254)
Show SMILES CCOC(\C=C\c1ccc(cc1)C(N)=N)C(C)(C)C(=O)N1CCC(CC(O)=O)CC1
Show InChI InChI=1S/C23H33N3O4/c1-4-30-19(10-7-16-5-8-18(9-6-16)21(24)25)23(2,3)22(29)26-13-11-17(12-14-26)15-20(27)28/h5-10,17,19H,4,11-15H2,1-3H3,(H3,24,25)(H,27,28)/b10-7+
n/an/a 129n/an/an/an/an/an/a
Kyoto University
Curated by ChEMBL
Assay Description
The compound was tested for its inhibitory activity against platelet aggregation
Bioorg Med Chem Lett 10: 859-63 (2000)
BindingDB Entry DOI: 10.7270/Q2W95BFN