BDBM50421554 CHEMBL107875
SMILES: Fc1cccc(C(COCc2cc(cc(c2)C(F)(F)F)C(F)(F)F)N2CCNCC2)c1F
InChI Key: InChIKey=ZORXDXJSPINJEQ-UHFFFAOYSA-N
Data: 1 KI  2 IC50
Activity Spreadsheet -- Enzyme Inhibition Constant Data from BindingDB
Found 3 hits for monomerid = 50421554
Trg + Lig
Ki
nM
ΔG°
kcal/mole
IC50
nM
Kd
nM
EC50/IC50
nM
koff
s-1
kon
M-1s-1
pHTemp
°C
Neurokinin 1 receptor
(Homo sapiens (Human))
BDBM50421554
(CHEMBL107875)
Show SMILES Fc1cccc(C(COCc2cc(cc(c2)C(F)(F)F)C(F)(F)F)N2CCNCC2)c1F
Show InChI InChI=1S/C21H20F8N2O/c22-17-3-1-2-16(19(17)23)18(31-6-4-30-5-7-31)12-32-11-13-8-14(20(24,25)26)10-15(9-13)21(27,28)29/h1-3,8-10,18,30H,4-7,11-12H2
Reactome pathway
3.20n/an/an/an/an/an/an/an/a
UCB Pharma
Curated by ChEMBL
Assay Description
Displacement of [3H]-substance P from human NK1 receptor expressed in CHO cells
Bioorg Med Chem Lett 13: 437-42 (2003)
Checked by Author
BindingDB Entry DOI: 10.7270/Q2MC91J0
Sodium-dependent serotonin transporter
(Rattus norvegicus (rat))
BDBM50421554
(CHEMBL107875)
Show SMILES Fc1cccc(C(COCc2cc(cc(c2)C(F)(F)F)C(F)(F)F)N2CCNCC2)c1F
Show InChI InChI=1S/C21H20F8N2O/c22-17-3-1-2-16(19(17)23)18(31-6-4-30-5-7-31)12-32-11-13-8-14(20(24,25)26)10-15(9-13)21(27,28)29/h1-3,8-10,18,30H,4-7,11-12H2
n/an/a 316n/an/an/an/an/an/a
UCB Pharma SA
Curated by ChEMBL
Assay Description
Binding affinity against Serotonin transporter in rat cerebral cortex using [3H]paroxetine binding assay.
Bioorg Med Chem Lett 12: 3195-8 (2002)
BindingDB Entry DOI: 10.7270/Q2KW5HBF
Neurokinin 1 receptor
(Homo sapiens (Human))
BDBM50421554
(CHEMBL107875)
Show SMILES Fc1cccc(C(COCc2cc(cc(c2)C(F)(F)F)C(F)(F)F)N2CCNCC2)c1F
Show InChI InChI=1S/C21H20F8N2O/c22-17-3-1-2-16(19(17)23)18(31-6-4-30-5-7-31)12-32-11-13-8-14(20(24,25)26)10-15(9-13)21(27,28)29/h1-3,8-10,18,30H,4-7,11-12H2
Reactome pathway
n/an/a 3.20n/an/an/an/an/an/a
UCB Pharma SA
Curated by ChEMBL
Assay Description
Binding affinity against human Tachykinin receptor 1 expressed in CHO cells using [3H]-substance P as the radioligand
Bioorg Med Chem Lett 12: 3195-8 (2002)
BindingDB Entry DOI: 10.7270/Q2KW5HBF