BDBM50421575 CHEMBL118055
SMILES: CSc1ccccc1NCc1cnc[nH]1
InChI Key: InChIKey=HHQOMPROOBMQGY-UHFFFAOYSA-N
Data: 3 IC50  3 EC50
Activity Spreadsheet -- Enzyme Inhibition Constant Data from BindingDB
Found 6 hits for monomerid = 50421575
Trg + Lig
Ki
nM
ΔG°
kcal/mole
IC50
nM
Kd
nM
EC50/IC50
nM
koff
s-1
kon
M-1s-1
pHTemp
°C
Alpha-1A adrenergic receptor
(Homo sapiens (Human))
BDBM50421575
(CHEMBL118055)
Show SMILES CSc1ccccc1NCc1cnc[nH]1
Show InChI InChI=1S/C11H13N3S/c1-15-11-5-3-2-4-10(11)13-7-9-6-12-8-14-9/h2-6,8,13H,7H2,1H3,(H,12,14)
Reactome pathway
n/an/an/an/a 10n/an/an/an/a
GlaxoSmithKline Research and Development
Curated by ChEMBL
Assay Description
Activation of human alpha-1A adrenergic receptor expressed in rat-1 fibroblasts
Bioorg Med Chem Lett 12: 3449-52 (2002)
BindingDB Entry DOI: 10.7270/Q2G44RM1
Alpha adrenergic receptor (1a and 1d)
(Homo sapiens (Human))
BDBM50421575
(CHEMBL118055)
Show SMILES CSc1ccccc1NCc1cnc[nH]1
Show InChI InChI=1S/C11H13N3S/c1-15-11-5-3-2-4-10(11)13-7-9-6-12-8-14-9/h2-6,8,13H,7H2,1H3,(H,12,14)
Reactome pathway
n/an/an/an/a 20n/an/an/an/a
GlaxoSmithKline Research and Development
Curated by ChEMBL
Assay Description
Activation of human Alpha-1D adrenergic receptors expressed in rat-1 fibroblasts
Bioorg Med Chem Lett 12: 3449-52 (2002)
BindingDB Entry DOI: 10.7270/Q2G44RM1
Adrenergic alpha1B
(Homo sapiens (Human))
BDBM50421575
(CHEMBL118055)
Show SMILES CSc1ccccc1NCc1cnc[nH]1
Show InChI InChI=1S/C11H13N3S/c1-15-11-5-3-2-4-10(11)13-7-9-6-12-8-14-9/h2-6,8,13H,7H2,1H3,(H,12,14)
n/an/a 891n/an/an/an/an/an/a
GlaxoSmithKline Research and Development
Curated by ChEMBL
Assay Description
In vitro binding affinity against cloned human alpha-1B-adrenoreceptor receptors expressed in rat-1 fibroblasts
Bioorg Med Chem Lett 12: 3449-52 (2002)
BindingDB Entry DOI: 10.7270/Q2G44RM1
Alpha-1D adrenergic receptor
(Homo sapiens (Human))
BDBM50421575
(CHEMBL118055)
Show SMILES CSc1ccccc1NCc1cnc[nH]1
Show InChI InChI=1S/C11H13N3S/c1-15-11-5-3-2-4-10(11)13-7-9-6-12-8-14-9/h2-6,8,13H,7H2,1H3,(H,12,14)
Reactome pathway
n/an/a 58n/an/an/an/an/an/a
GlaxoSmithKline Research and Development
Curated by ChEMBL
Assay Description
In vitro binding affinity against cloned human alpha-1D-adrenoreceptor receptors expressed in rat-1 fibroblasts
Bioorg Med Chem Lett 12: 3449-52 (2002)
BindingDB Entry DOI: 10.7270/Q2G44RM1
Alpha-1A adrenergic receptor
(Homo sapiens (Human))
BDBM50421575
(CHEMBL118055)
Show SMILES CSc1ccccc1NCc1cnc[nH]1
Show InChI InChI=1S/C11H13N3S/c1-15-11-5-3-2-4-10(11)13-7-9-6-12-8-14-9/h2-6,8,13H,7H2,1H3,(H,12,14)
Reactome pathway
n/an/a 170n/an/an/an/an/an/a
GlaxoSmithKline Research and Development
Curated by ChEMBL
Assay Description
In vitro binding affinity against cloned human alpha-1A-adrenoreceptor receptors expressed in rat-1 fibroblasts
Bioorg Med Chem Lett 12: 3449-52 (2002)
BindingDB Entry DOI: 10.7270/Q2G44RM1
Adrenergic receptor alpha
(Homo sapiens (Human))
BDBM50421575
(CHEMBL118055)
Show SMILES CSc1ccccc1NCc1cnc[nH]1
Show InChI InChI=1S/C11H13N3S/c1-15-11-5-3-2-4-10(11)13-7-9-6-12-8-14-9/h2-6,8,13H,7H2,1H3,(H,12,14)
n/an/an/an/a 25n/an/an/an/a
GlaxoSmithKline Research and Development
Curated by ChEMBL
Assay Description
Activation of human alpha-1B adrenergic receptors expressed in rat-1 fibroblasts
Bioorg Med Chem Lett 12: 3449-52 (2002)
BindingDB Entry DOI: 10.7270/Q2G44RM1