BDBM50421904 CHEMBL553561
SMILES: C1CN(C[C@@H]2CCc3ccccc3[C@H]12)C12C[C@H]3C[C@H](C[C@H](C3)C1)C2
InChI Key: InChIKey=FMFPCXNMOGPMDI-GCJCMNQMSA-N
Data: 2 IC50
Activity Spreadsheet -- Enzyme Inhibition Constant Data from BindingDB
Found 2 hits for monomerid = 50421904
Trg + Lig
Ki
nM
ΔG°
kcal/mole
IC50
nM
Kd
nM
EC50/IC50
nM
koff
s-1
kon
M-1s-1
pHTemp
°C
Sigma non-opioid intracellular receptor 1
(Homo sapiens (Human))
BDBM50421904
(CHEMBL553561)
Show SMILES C1CN(C[C@@H]2CCc3ccccc3[C@H]12)C12C[C@H]3C[C@H](C[C@H](C3)C1)C2 |r,THB:19:20:15:23.18.17,19:18:15:22.20.21|
Show InChI InChI=1S/C23H31N/c1-2-4-21-19(3-1)5-6-20-15-24(8-7-22(20)21)23-12-16-9-17(13-23)11-18(10-16)14-23/h1-4,16-18,20,22H,5-15H2/t16-,17+,18-,20-,22+,23?/m0/s1
n/an/a 2.30n/an/an/an/an/an/a
Merck Sharp and Dohme Research Laboratories
Curated by ChEMBL
Assay Description
In vitro for the binding affinity against sigma receptor by using [3H]DTG as radioligand in guinea pig cerebellum
J Med Chem 35: 2025-33 (1992)
BindingDB Entry DOI: 10.7270/Q2MP54K8
D(2) dopamine receptor
(Rattus norvegicus (rat))
BDBM50421904
(CHEMBL553561)
Show SMILES C1CN(C[C@@H]2CCc3ccccc3[C@H]12)C12C[C@H]3C[C@H](C[C@H](C3)C1)C2 |r,THB:19:20:15:23.18.17,19:18:15:22.20.21|
Show InChI InChI=1S/C23H31N/c1-2-4-21-19(3-1)5-6-20-15-24(8-7-22(20)21)23-12-16-9-17(13-23)11-18(10-16)14-23/h1-4,16-18,20,22H,5-15H2/t16-,17+,18-,20-,22+,23?/m0/s1
Reactome pathway
n/an/a<1.00E+4n/an/an/an/an/an/a
Merck Sharp and Dohme Research Laboratories
Curated by ChEMBL
Assay Description
Inhibition of [3H](-)-sulpiride binding to rat striatum dopamine receptor D2
J Med Chem 35: 2025-33 (1992)
BindingDB Entry DOI: 10.7270/Q2MP54K8