BDBM50421926 CHEMBL541052
SMILES: COc1ccc(CN2CC[C@@H]3[C@@H](CCc4ccccc34)C2)cc1
InChI Key: InChIKey=MDACNEPDEQTBEM-GHTZIAJQSA-N
Data: 2 IC50
Activity Spreadsheet -- Enzyme Inhibition Constant Data from BindingDB
Found 2 hits for monomerid = 50421926
Trg + Lig
Ki
nM
ΔG°
kcal/mole
IC50
nM
Kd
nM
EC50/IC50
nM
koff
s-1
kon
M-1s-1
pHTemp
°C
Sigma non-opioid intracellular receptor 1
(Homo sapiens (Human))
BDBM50421926
(CHEMBL541052)
Show SMILES COc1ccc(CN2CC[C@@H]3[C@@H](CCc4ccccc34)C2)cc1 |r|
Show InChI InChI=1S/C21H25NO/c1-23-19-10-6-16(7-11-19)14-22-13-12-21-18(15-22)9-8-17-4-2-3-5-20(17)21/h2-7,10-11,18,21H,8-9,12-15H2,1H3/t18-,21+/m0/s1
n/an/a 2n/an/an/an/an/an/a
Merck Sharp and Dohme Research Laboratories
Curated by ChEMBL
Assay Description
In vitro for the binding affinity against sigma receptor by using [3H]DTG as radioligand in guinea pig cerebellum
J Med Chem 35: 2025-33 (1992)
BindingDB Entry DOI: 10.7270/Q2MP54K8
D(2) dopamine receptor
(Rattus norvegicus (rat))
BDBM50421926
(CHEMBL541052)
Show SMILES COc1ccc(CN2CC[C@@H]3[C@@H](CCc4ccccc34)C2)cc1 |r|
Show InChI InChI=1S/C21H25NO/c1-23-19-10-6-16(7-11-19)14-22-13-12-21-18(15-22)9-8-17-4-2-3-5-20(17)21/h2-7,10-11,18,21H,8-9,12-15H2,1H3/t18-,21+/m0/s1
Reactome pathway
n/an/a 35n/an/an/an/an/an/a
Merck Sharp and Dohme Research Laboratories
Curated by ChEMBL
Assay Description
Inhibition of [3H](-)-sulpiride binding to rat striatum dopamine receptor D2
J Med Chem 35: 2025-33 (1992)
BindingDB Entry DOI: 10.7270/Q2MP54K8