BDBM50422276 CHEMBL2303755
SMILES: CCCCCCCCCCCCCCC(CCCCCCCCCCCCCC)C(=O)N[C@H](CO[C@H]1O[C@H](CO)[C@@H](O)[C@@H](O)[C@@H]1O)C(=O)N[C@@H](CCC(O)=O)C(=O)NC
InChI Key: InChIKey=CSCUNDOLFOXROO-FPFJYUFZSA-N
Data: 3 IC50
Activity Spreadsheet -- Enzyme Inhibition Constant Data from BindingDB
Found 3 hits for monomerid = 50422276
Trg + Lig
Ki
nM
ΔG°
kcal/mole
IC50
nM
Kd
nM
EC50/IC50
nM
koff
s-1
kon
M-1s-1
pHTemp
°C
Leukocyte adhesion molecule-1
(Homo sapiens (Human))
BDBM50422276
(CHEMBL2303755)
Show SMILES CCCCCCCCCCCCCCC(CCCCCCCCCCCCCC)C(=O)N[C@H](CO[C@H]1O[C@H](CO)[C@@H](O)[C@@H](O)[C@@H]1O)C(=O)N[C@@H](CCC(O)=O)C(=O)NC |r|
Show InChI InChI=1S/C45H85N3O11/c1-4-6-8-10-12-14-16-18-20-22-24-26-28-34(29-27-25-23-21-19-17-15-13-11-9-7-5-2)42(55)48-36(44(57)47-35(43(56)46-3)30-31-38(50)51)33-58-45-41(54)40(53)39(52)37(32-49)59-45/h34-37,39-41,45,49,52-54H,4-33H2,1-3H3,(H,46,56)(H,47,57)(H,48,55)(H,50,51)/t35-,36+,37+,39+,40+,41-,45-/m0/s1
Reactome pathway
n/an/a 4.00E+3n/an/an/an/an/an/a
Kanebo
Curated by ChEMBL
Assay Description
Inhibition of Selectin L binding
J Med Chem 41: 4279-87 (1998)
Article DOI: 10.1021/jm980267x
BindingDB Entry DOI: 10.7270/Q2474BHN
P-selectin/P-selectin glycoprotein ligand 1
(Homo sapiens (Human))
BDBM50422276
(CHEMBL2303755)
Show SMILES CCCCCCCCCCCCCCC(CCCCCCCCCCCCCC)C(=O)N[C@H](CO[C@H]1O[C@H](CO)[C@@H](O)[C@@H](O)[C@@H]1O)C(=O)N[C@@H](CCC(O)=O)C(=O)NC |r|
Show InChI InChI=1S/C45H85N3O11/c1-4-6-8-10-12-14-16-18-20-22-24-26-28-34(29-27-25-23-21-19-17-15-13-11-9-7-5-2)42(55)48-36(44(57)47-35(43(56)46-3)30-31-38(50)51)33-58-45-41(54)40(53)39(52)37(32-49)59-45/h34-37,39-41,45,49,52-54H,4-33H2,1-3H3,(H,46,56)(H,47,57)(H,48,55)(H,50,51)/t35-,36+,37+,39+,40+,41-,45-/m0/s1
NCI pathway
Reactome pathway
n/an/a 450n/an/an/an/an/an/a
Kanebo
Curated by ChEMBL
Assay Description
Inhibition of Selectin P binding
J Med Chem 41: 4279-87 (1998)
Article DOI: 10.1021/jm980267x
BindingDB Entry DOI: 10.7270/Q2474BHN
Selectin E
(Homo sapiens (Human))
BDBM50422276
(CHEMBL2303755)
Show SMILES CCCCCCCCCCCCCCC(CCCCCCCCCCCCCC)C(=O)N[C@H](CO[C@H]1O[C@H](CO)[C@@H](O)[C@@H](O)[C@@H]1O)C(=O)N[C@@H](CCC(O)=O)C(=O)NC |r|
Show InChI InChI=1S/C45H85N3O11/c1-4-6-8-10-12-14-16-18-20-22-24-26-28-34(29-27-25-23-21-19-17-15-13-11-9-7-5-2)42(55)48-36(44(57)47-35(43(56)46-3)30-31-38(50)51)33-58-45-41(54)40(53)39(52)37(32-49)59-45/h34-37,39-41,45,49,52-54H,4-33H2,1-3H3,(H,46,56)(H,47,57)(H,48,55)(H,50,51)/t35-,36+,37+,39+,40+,41-,45-/m0/s1
NCI pathway
Reactome pathway
n/an/a 3.50E+3n/an/an/an/an/an/a
Kanebo
Curated by ChEMBL
Assay Description
Displacement of sialyl Lewis X (sLex) from selectin E
J Med Chem 41: 4279-87 (1998)
Article DOI: 10.1021/jm980267x
BindingDB Entry DOI: 10.7270/Q2474BHN