BDBM50422473 CHEMBL99006
SMILES: OC(Cn1cncn1)(P(O)(O)=O)P(O)(O)=O
InChI Key: InChIKey=AHQODVZXEYHKRU-UHFFFAOYSA-N
Data: 1 IC50
Activity Spreadsheet -- Enzyme Inhibition Constant Data from BindingDB
Found 1 hit for monomerid = 50422473
Trg + Lig
Ki
nM
ΔG°
kcal/mole
IC50
nM
Kd
nM
EC50/IC50
nM
koff
s-1
kon
M-1s-1
pHTemp
°C
Farnesyl diphosphate synthase
(Homo sapiens (Human))
BDBM50422473
(CHEMBL99006)
Show SMILES OC(Cn1cncn1)(P(O)(O)=O)P(O)(O)=O
Show InChI InChI=1S/C4H9N3O7P2/c8-4(15(9,10)11,16(12,13)14)1-7-3-5-2-6-7/h2-3,8H,1H2,(H2,9,10,11)(H2,12,13,14)
Reactome pathway
n/an/a 2.20E+3n/an/an/an/an/an/a
University of Illinois at Urbana-Champaign
Curated by ChEMBL
Assay Description
Negative logarithm of inhibitory concentration against bone resorption
J Med Chem 46: 2932-44 (2003)
Article DOI: 10.1021/jm030054u
BindingDB Entry DOI: 10.7270/Q2R78GHD