BDBM50422480 CHEMBL101647
SMILES: OC(CCn1ccnc1)(P(O)(O)=O)P(O)(O)=O
InChI Key: InChIKey=FZPDZVJIVRYKHR-UHFFFAOYSA-N
Data: 1 IC50
Activity Spreadsheet -- Enzyme Inhibition Constant Data from BindingDB
Found 1 hit for monomerid = 50422480
Trg + Lig
Ki
nM
ΔG°
kcal/mole
IC50
nM
Kd
nM
EC50/IC50
nM
koff
s-1
kon
M-1s-1
pHTemp
°C
Farnesyl diphosphate synthase
(Homo sapiens (Human))
BDBM50422480
(CHEMBL101647)
Show SMILES OC(CCn1ccnc1)(P(O)(O)=O)P(O)(O)=O
Show InChI InChI=1S/C6H12N2O7P2/c9-6(16(10,11)12,17(13,14)15)1-3-8-4-2-7-5-8/h2,4-5,9H,1,3H2,(H2,10,11,12)(H2,13,14,15)
Reactome pathway
n/an/a 157n/an/an/an/an/an/a
University of Illinois at Urbana-Champaign
Curated by ChEMBL
Assay Description
Negative logarithm of inhibitory concentration against bone resorption
J Med Chem 46: 2932-44 (2003)
Article DOI: 10.1021/jm030054u
BindingDB Entry DOI: 10.7270/Q2R78GHD