null
SMILES: CCCCCOc1c(OC)ccc2cc(NC(=O)Cc3ccc4OCOc4c3)c(=O)[nH]c12
InChI Key: InChIKey=SFZJMRPQOQJFGI-UHFFFAOYSA-N
Activity Spreadsheet -- Enzyme Inhibition Constant Data from BindingDB
Found 1 hit for monomerid = 50422831
Trg + Lig
Ki
nM
ΔG°
kcal/mole
IC50
nM
Kd
nM
EC50/IC50
nM
koff
s-1
kon
M-1s-1
pHTemp
°C
Cannabinoid receptor 2
(Homo sapiens (Human))
BDBM50422831
(CHEMBL381313)
Show SMILES CCCCCOc1c(OC)ccc2cc(NC(=O)Cc3ccc4OCOc4c3)c(=O)[nH]c12
Show InChI InChI=1S/C24H26N2O6/c1-3-4-5-10-30-23-19(29-2)9-7-16-13-17(24(28)26-22(16)23)25-21(27)12-15-6-8-18-20(11-15)32-14-31-18/h6-9,11,13H,3-5,10,12,14H2,1-2H3,(H,25,27)(H,26,28)
Reactome pathway
n/an/a 20n/an/an/an/an/an/a
University of Kuopio
Curated by ChEMBL
Assay Description
Inhibition of [35S]GTP-gamma-S binding to human CB2 receptor expressed in CHO cells
J Med Chem 49: 2022-7 (2006)
Article DOI: 10.1021/jm050879z
BindingDB Entry DOI: 10.7270/Q21J9C3R