BDBM50423057 CHEMBL242573
SMILES: O=C(NCCCc1cn2CCCc3cccc1c23)C1CC1
InChI Key: InChIKey=LGMKHPBEFOPMIS-UHFFFAOYSA-N
Data: 1 IC50
Activity Spreadsheet -- Enzyme Inhibition Constant Data from BindingDB
Found 1 hit for monomerid = 50423057
Trg + Lig
Ki
nM
ΔG°
kcal/mole
IC50
nM
Kd
nM
EC50/IC50
nM
koff
s-1
kon
M-1s-1
pHTemp
°C
Melatonin 1C
(Xenopus)
BDBM50423057
(CHEMBL242573)
Show SMILES O=C(NCCCc1cn2CCCc3cccc1c23)C1CC1
Show InChI InChI=1S/C18H22N2O/c21-18(14-8-9-14)19-10-2-5-15-12-20-11-3-6-13-4-1-7-16(15)17(13)20/h1,4,7,12,14H,2-3,5-6,8-11H2,(H,19,21)
n/an/a 1.51E+3n/an/an/an/an/an/a
University of Athens
Curated by ChEMBL
Assay Description
Antagonist activity in Xenopus laevis melanophores assessed as melatoninergic activity after 60 mins
Eur J Med Chem 42: 1004-13 (2007)
Article DOI: 10.1016/j.ejmech.2007.01.005
BindingDB Entry DOI: 10.7270/Q2B859BK