BDBM50423204 CHEMBL246922
SMILES: Cc1ccc(cc1S(=O)(=O)N1CCOCC1)C(=O)Oc1ccccc1Br
InChI Key: InChIKey=LKVVDEMKJBMVCT-UHFFFAOYSA-N
Data: 1 IC50
Activity Spreadsheet -- Enzyme Inhibition Constant Data from BindingDB
Found 1 hit for monomerid = 50423204
Trg + Lig
Ki
nM
ΔG°
kcal/mole
IC50
nM
Kd
nM
EC50/IC50
nM
koff
s-1
kon
M-1s-1
pHTemp
°C
Cannabinoid receptor 1
(Homo sapiens (Human))
BDBM50423204
(CHEMBL246922)
Show SMILES Cc1ccc(cc1S(=O)(=O)N1CCOCC1)C(=O)Oc1ccccc1Br
Show InChI InChI=1S/C18H18BrNO5S/c1-13-6-7-14(18(21)25-16-5-3-2-4-15(16)19)12-17(13)26(22,23)20-8-10-24-11-9-20/h2-7,12H,8-11H2,1H3
NCI pathway
Reactome pathway
n/an/a 32n/an/an/an/an/an/a
UCB S.A.
Curated by ChEMBL
Assay Description
Binding affinity to human recombinant CB1 receptor
Bioorg Med Chem Lett 17: 272-7 (2006)
Article DOI: 10.1016/j.bmcl.2006.09.049
BindingDB Entry DOI: 10.7270/Q2FN17GR