BDBM50423217 CHEMBL246923
SMILES: Cc1ccc(cc1S(=O)(=O)N1CCCCC1)C(=O)Nc1cccc2cnccc12
InChI Key: InChIKey=VNTJNTWECDSKEC-UHFFFAOYSA-N
Data: 1 IC50
Activity Spreadsheet -- Enzyme Inhibition Constant Data from BindingDB
Found 1 hit for monomerid = 50423217
Trg + Lig
Ki
nM
ΔG°
kcal/mole
IC50
nM
Kd
nM
EC50/IC50
nM
koff
s-1
kon
M-1s-1
pHTemp
°C
Cannabinoid receptor 1
(Homo sapiens (Human))
BDBM50423217
(CHEMBL246923)
Show SMILES Cc1ccc(cc1S(=O)(=O)N1CCCCC1)C(=O)Nc1cccc2cnccc12
Show InChI InChI=1S/C22H23N3O3S/c1-16-8-9-17(14-21(16)29(27,28)25-12-3-2-4-13-25)22(26)24-20-7-5-6-18-15-23-11-10-19(18)20/h5-11,14-15H,2-4,12-13H2,1H3,(H,24,26)
NCI pathway
Reactome pathway
n/an/a 1.26E+3n/an/an/an/an/an/a
UCB S.A.
Curated by ChEMBL
Assay Description
Binding affinity to human recombinant CB1 receptor
Bioorg Med Chem Lett 17: 272-7 (2006)
Article DOI: 10.1016/j.bmcl.2006.09.049
BindingDB Entry DOI: 10.7270/Q2FN17GR