null
SMILES: CCCCCCN1CCC(CC1)N1CC(OC1=O)c1ccnc2ccc(OC)cc12
InChI Key: InChIKey=PSSYDOSVEYFXCT-UHFFFAOYSA-N
Activity Spreadsheet -- Enzyme Inhibition Constant Data from BindingDB
Found 1 hit for monomerid = 50423256
Trg + Lig
Ki
nM
ΔG°
kcal/mole
IC50
nM
Kd
nM
EC50/IC50
nM
koff
s-1
kon
M-1s-1
pHTemp
°C
C-C chemokine receptor type 8
(Homo sapiens (Human))
BDBM50423256
(CHEMBL443315)
Show SMILES CCCCCCN1CCC(CC1)N1CC(OC1=O)c1ccnc2ccc(OC)cc12
Show InChI InChI=1S/C24H33N3O3/c1-3-4-5-6-13-26-14-10-18(11-15-26)27-17-23(30-24(27)28)20-9-12-25-22-8-7-19(29-2)16-21(20)22/h7-9,12,16,18,23H,3-6,10-11,13-15,17H2,1-2H3
Reactome pathway
n/an/a 501n/an/an/an/an/an/a
GlaxoSmithKline
Curated by ChEMBL
Assay Description
Antagonist activity at human recombinant CCR8 expressed in RBL cells assessed as inhibition of I-309-induced intracellular calcium mobilization by FL...
Bioorg Med Chem Lett 17: 1722-5 (2007)
Article DOI: 10.1016/j.bmcl.2006.12.076
BindingDB Entry DOI: 10.7270/Q2668FG7