null
SMILES: COc1ccc2nccc(C3CN(C4CCN(Cc5ccc(Cl)c(Cl)c5)CC4)C(=O)O3)c2c1
InChI Key: InChIKey=UPBONKUQKKQLND-UHFFFAOYSA-N
Activity Spreadsheet -- Enzyme Inhibition Constant Data from BindingDB
Found 1 hit for monomerid = 50423259
Trg + Lig
Ki
nM
ΔG°
kcal/mole
IC50
nM
Kd
nM
EC50/IC50
nM
koff
s-1
kon
M-1s-1
pHTemp
°C
C-C chemokine receptor type 8
(Homo sapiens (Human))
BDBM50423259
(CHEMBL395211)
Show SMILES COc1ccc2nccc(C3CN(C4CCN(Cc5ccc(Cl)c(Cl)c5)CC4)C(=O)O3)c2c1
Show InChI InChI=1S/C25H25Cl2N3O3/c1-32-18-3-5-23-20(13-18)19(6-9-28-23)24-15-30(25(31)33-24)17-7-10-29(11-8-17)14-16-2-4-21(26)22(27)12-16/h2-6,9,12-13,17,24H,7-8,10-11,14-15H2,1H3
Reactome pathway
n/an/a 126n/an/an/an/an/an/a
GlaxoSmithKline
Curated by ChEMBL
Assay Description
Antagonist activity at human recombinant CCR8 expressed in RBL cells assessed as inhibition of I-309-induced intracellular calcium mobilization by FL...
Bioorg Med Chem Lett 17: 1722-5 (2007)
Article DOI: 10.1016/j.bmcl.2006.12.076
BindingDB Entry DOI: 10.7270/Q2668FG7