null
SMILES: CCCC(CCC)n1cc2CCN(c3ccc(OC)c(F)c3)c3nc(C)cc1c23
InChI Key: InChIKey=ISRRVJLUIKXJQL-UHFFFAOYSA-N
Activity Spreadsheet -- Enzyme Inhibition Constant Data from BindingDB
Found 1 hit for monomerid = 50423383
Trg + Lig
Ki
nM
ΔG°
kcal/mole
IC50
nM
Kd
nM
EC50/IC50
nM
koff
s-1
kon
M-1s-1
pHTemp
°C
Corticotropin-releasing factor receptor 1
(Homo sapiens (Human))
BDBM50423383
(CHEMBL250182)
Show SMILES CCCC(CCC)n1cc2CCN(c3ccc(OC)c(F)c3)c3nc(C)cc1c23
Show InChI InChI=1S/C24H30FN3O/c1-5-7-18(8-6-2)28-15-17-11-12-27(19-9-10-22(29-4)20(25)14-19)24-23(17)21(28)13-16(3)26-24/h9-10,13-15,18H,5-8,11-12H2,1-4H3
Reactome pathway
n/an/a 40n/an/an/an/an/an/a
GlaxoSmithkline
Curated by ChEMBL
Assay Description
Displacement of [125I]CRF from human recombinant CRF1 receptor expressed in CHO cell membrane
Bioorg Med Chem Lett 17: 5218-21 (2007)
Article DOI: 10.1016/j.bmcl.2007.06.077
BindingDB Entry DOI: 10.7270/Q2P55PS1