BDBM50423648 CHEMBL1334465::SB-408124
SMILES: CN(C)c1ccc(NC(=O)Nc2cc(C)nc3c(F)cc(F)cc23)cc1
InChI Key: InChIKey=JTARFZSNUAGHRB-UHFFFAOYSA-N
Data: 9 KI  1 Kd
PDB links: 1 PDB ID matches this monomer.
Activity Spreadsheet -- Enzyme Inhibition Constant Data from BindingDB
Found 10 hits for monomerid = 50423648
Trg + Lig
Ki
nM
ΔG°
kcal/mole
IC50
nM
Kd
nM
EC50/IC50
nM
koff
s-1
kon
M-1s-1
pHTemp
°C
Orexin receptor type 1
(Homo sapiens (Human))
BDBM50423648
(CHEMBL1334465 | SB-408124)
Show SMILES CN(C)c1ccc(NC(=O)Nc2cc(C)nc3c(F)cc(F)cc23)cc1
Show InChI InChI=1S/C19H18F2N4O/c1-11-8-17(15-9-12(20)10-16(21)18(15)22-11)24-19(26)23-13-4-6-14(7-5-13)25(2)3/h4-10H,1-3H3,(H2,22,23,24,26)
Reactome pathway
19n/an/an/an/an/an/an/an/a
University of Tsukuba
Curated by ChEMBL
Assay Description
Antagonist activity at human OX1R expressed in CHOK1 cells assessed as inhibition of orexin A-induced intracellular calcium level preincubated for 15...
J Med Chem 60: 1018-1040 (2017)
BindingDB Entry DOI: 10.7270/Q22N54JH
3D
3D Structure (crystal)
Orexin receptor type 1
(Homo sapiens (Human))
BDBM50423648
(CHEMBL1334465 | SB-408124)
Show SMILES CN(C)c1ccc(NC(=O)Nc2cc(C)nc3c(F)cc(F)cc23)cc1
Show InChI InChI=1S/C19H18F2N4O/c1-11-8-17(15-9-12(20)10-16(21)18(15)22-11)24-19(26)23-13-4-6-14(7-5-13)25(2)3/h4-10H,1-3H3,(H2,22,23,24,26)
Reactome pathway
22n/an/an/an/an/an/an/an/a
Janssen Research& Development
Curated by ChEMBL
Assay Description
Binding affinity to orexin receptor 1 (unknown origin)
Bioorg Med Chem Lett 23: 4761-9 (2013)
Article DOI: 10.1016/j.bmcl.2013.06.057
BindingDB Entry DOI: 10.7270/Q25140NJ
3D
3D Structure (crystal)
Orexin receptor type 1
(Homo sapiens (Human))
BDBM50423648
(CHEMBL1334465 | SB-408124)
Show SMILES CN(C)c1ccc(NC(=O)Nc2cc(C)nc3c(F)cc(F)cc23)cc1
Show InChI InChI=1S/C19H18F2N4O/c1-11-8-17(15-9-12(20)10-16(21)18(15)22-11)24-19(26)23-13-4-6-14(7-5-13)25(2)3/h4-10H,1-3H3,(H2,22,23,24,26)
Reactome pathway
25n/an/an/an/an/an/an/an/a
Sosei Heptares
Curated by ChEMBL
Assay Description
Displacement of [3H]4-(2,6-Difluoro-4-methoxybenzyl)-2-(5,6-dimethoxypyridin-3-yl)-2H-1,2,4-benzothiadiazin-3(4H)-one 1,1-dioxide from human wild-typ...
J Med Chem 63: 1528-1543 (2020)
Article DOI: 10.1021/acs.jmedchem.9b01787
3D
3D Structure (crystal)
Orexin receptor type 2
(Homo sapiens (Human))
BDBM50423648
(CHEMBL1334465 | SB-408124)
Show SMILES CN(C)c1ccc(NC(=O)Nc2cc(C)nc3c(F)cc(F)cc23)cc1
Show InChI InChI=1S/C19H18F2N4O/c1-11-8-17(15-9-12(20)10-16(21)18(15)22-11)24-19(26)23-13-4-6-14(7-5-13)25(2)3/h4-10H,1-3H3,(H2,22,23,24,26)
Reactome pathway
794n/an/an/an/an/an/an/an/a
Sosei Heptares
Curated by ChEMBL
Assay Description
Displacement of [3H]4-(2,6-Difluoro-4-methoxybenzyl)-2-(5,6-dimethoxypyridin-3-yl)-2H-1,2,4-benzothiadiazin-3(4H)-one 1,1-dioxide from human wild-typ...
J Med Chem 63: 1528-1543 (2020)
Article DOI: 10.1021/acs.jmedchem.9b01787
Kappa-type opioid receptor
(Homo sapiens (Human))
BDBM50423648
(CHEMBL1334465 | SB-408124)
Show SMILES CN(C)c1ccc(NC(=O)Nc2cc(C)nc3c(F)cc(F)cc23)cc1
Show InChI InChI=1S/C19H18F2N4O/c1-11-8-17(15-9-12(20)10-16(21)18(15)22-11)24-19(26)23-13-4-6-14(7-5-13)25(2)3/h4-10H,1-3H3,(H2,22,23,24,26)
Reactome pathway
>1.00E+3n/an/an/an/an/an/an/an/a
University of Tsukuba
Curated by ChEMBL
Assay Description
Displacement of [3H]U69,593 from human kappa opioid receptor expressed in CHO cell membranes by micro-beta scintillation counting method
J Med Chem 60: 1018-1040 (2017)
BindingDB Entry DOI: 10.7270/Q22N54JH
Mu-type opioid receptor
(Homo sapiens (Human))
BDBM50423648
(CHEMBL1334465 | SB-408124)
Show SMILES CN(C)c1ccc(NC(=O)Nc2cc(C)nc3c(F)cc(F)cc23)cc1
Show InChI InChI=1S/C19H18F2N4O/c1-11-8-17(15-9-12(20)10-16(21)18(15)22-11)24-19(26)23-13-4-6-14(7-5-13)25(2)3/h4-10H,1-3H3,(H2,22,23,24,26)
NCI pathway
Reactome pathway
>1.00E+3n/an/an/an/an/an/an/an/a
University of Tsukuba
Curated by ChEMBL
Assay Description
Displacement of [3H]DAMGO from human mu opioid receptor expressed in CHO cell membranes by micro-beta scintillation counting method
J Med Chem 60: 1018-1040 (2017)
BindingDB Entry DOI: 10.7270/Q22N54JH
Delta-type opioid receptor
(Homo sapiens (Human))
BDBM50423648
(CHEMBL1334465 | SB-408124)
Show SMILES CN(C)c1ccc(NC(=O)Nc2cc(C)nc3c(F)cc(F)cc23)cc1
Show InChI InChI=1S/C19H18F2N4O/c1-11-8-17(15-9-12(20)10-16(21)18(15)22-11)24-19(26)23-13-4-6-14(7-5-13)25(2)3/h4-10H,1-3H3,(H2,22,23,24,26)
Reactome pathway
>1.00E+3n/an/an/an/an/an/an/an/a
University of Tsukuba
Curated by ChEMBL
Assay Description
Displacement of [3H]DPDPE from human delta opioid receptor expressed in CHO cell membranes by micro-beta scintillation counting method
J Med Chem 60: 1018-1040 (2017)
BindingDB Entry DOI: 10.7270/Q22N54JH
Orexin receptor type 2
(Homo sapiens (Human))
BDBM50423648
(CHEMBL1334465 | SB-408124)
Show SMILES CN(C)c1ccc(NC(=O)Nc2cc(C)nc3c(F)cc(F)cc23)cc1
Show InChI InChI=1S/C19H18F2N4O/c1-11-8-17(15-9-12(20)10-16(21)18(15)22-11)24-19(26)23-13-4-6-14(7-5-13)25(2)3/h4-10H,1-3H3,(H2,22,23,24,26)
Reactome pathway
1.41E+3n/an/an/an/an/an/an/an/a
Janssen Research& Development
Curated by ChEMBL
Assay Description
Binding affinity to orexin receptor 2 (unknown origin)
Bioorg Med Chem Lett 23: 4761-9 (2013)
Article DOI: 10.1016/j.bmcl.2013.06.057
BindingDB Entry DOI: 10.7270/Q25140NJ
Orexin receptor type 2
(Homo sapiens (Human))
BDBM50423648
(CHEMBL1334465 | SB-408124)
Show SMILES CN(C)c1ccc(NC(=O)Nc2cc(C)nc3c(F)cc(F)cc23)cc1
Show InChI InChI=1S/C19H18F2N4O/c1-11-8-17(15-9-12(20)10-16(21)18(15)22-11)24-19(26)23-13-4-6-14(7-5-13)25(2)3/h4-10H,1-3H3,(H2,22,23,24,26)
Reactome pathway
2.07E+3n/an/an/an/an/an/an/an/a
University of Tsukuba
Curated by ChEMBL
Assay Description
Antagonist activity at human OX2R expressed in CHOK1 cells assessed as inhibition of orexin A-induced intracellular calcium level preincubated for 15...
J Med Chem 60: 1018-1040 (2017)
BindingDB Entry DOI: 10.7270/Q22N54JH
Orexin receptor type 1
(Homo sapiens (Human))
BDBM50423648
(CHEMBL1334465 | SB-408124)
Show SMILES CN(C)c1ccc(NC(=O)Nc2cc(C)nc3c(F)cc(F)cc23)cc1
Show InChI InChI=1S/C19H18F2N4O/c1-11-8-17(15-9-12(20)10-16(21)18(15)22-11)24-19(26)23-13-4-6-14(7-5-13)25(2)3/h4-10H,1-3H3,(H2,22,23,24,26)
Reactome pathway
n/an/an/a 27n/an/an/an/an/a
Actelion Pharmaceuticals Ltd.
Curated by ChEMBL
Assay Description
Binding affinity to OX1 receptor
J Med Chem 52: 891-903 (2009)
Article DOI: 10.1021/jm801296d
BindingDB Entry DOI: 10.7270/Q2TM7B3D
3D
3D Structure (crystal)