BDBM50423649 CHEMBL2110363::CHEMBL2413521::SB-674042
SMILES: Cc1nc(C(=O)N2CCC[C@H]2Cc2nnc(o2)-c2ccccc2)c(s1)-c1ccccc1F
InChI Key: InChIKey=HYBZWVLPALMACV-KRWDZBQOSA-N
Data: 4 KI  1 Kd
PDB links: 1 PDB ID matches this monomer.
Activity Spreadsheet -- Enzyme Inhibition Constant Data from BindingDB
Found 6 hits for monomerid = 50423649
Trg + Lig
Ki
nM
ΔG°
kcal/mole
IC50
nM
Kd
nM
EC50/IC50
nM
koff
s-1
kon
M-1s-1
pHTemp
°C
Orexin receptor type 1
(Homo sapiens (Human))
BDBM50423649
(CHEMBL2110363 | CHEMBL2413521 | SB-674042)
Show SMILES Cc1nc(C(=O)N2CCC[C@H]2Cc2nnc(o2)-c2ccccc2)c(s1)-c1ccccc1F |r|
Show InChI InChI=1S/C24H21FN4O2S/c1-15-26-21(22(32-15)18-11-5-6-12-19(18)25)24(30)29-13-7-10-17(29)14-20-27-28-23(31-20)16-8-3-2-4-9-16/h2-6,8-9,11-12,17H,7,10,13-14H2,1H3/t17-/m0/s1
Reactome pathway
1.10n/an/an/an/an/an/an/an/a
Janssen Research& Development
Curated by ChEMBL
Assay Description
Binding affinity to orexin receptor 1 (unknown origin)
Bioorg Med Chem Lett 23: 4761-9 (2013)
Article DOI: 10.1016/j.bmcl.2013.06.057
BindingDB Entry DOI: 10.7270/Q25140NJ
3D
3D Structure (crystal)
Orexin receptor type 1
(Homo sapiens (Human))
BDBM50423649
(CHEMBL2110363 | CHEMBL2413521 | SB-674042)
Show SMILES Cc1nc(C(=O)N2CCC[C@H]2Cc2nnc(o2)-c2ccccc2)c(s1)-c1ccccc1F |r|
Show InChI InChI=1S/C24H21FN4O2S/c1-15-26-21(22(32-15)18-11-5-6-12-19(18)25)24(30)29-13-7-10-17(29)14-20-27-28-23(31-20)16-8-3-2-4-9-16/h2-6,8-9,11-12,17H,7,10,13-14H2,1H3/t17-/m0/s1
Reactome pathway
1.10n/an/an/an/an/an/an/an/a
Janssen Research& Development
Curated by ChEMBL
Assay Description
Binding affinity to orexin receptor 1 (unknown origin)
Bioorg Med Chem Lett 23: 4761-9 (2013)
Article DOI: 10.1016/j.bmcl.2013.06.057
BindingDB Entry DOI: 10.7270/Q25140NJ
3D
3D Structure (crystal)
Orexin receptor type 1
(Homo sapiens (Human))
BDBM50423649
(CHEMBL2110363 | CHEMBL2413521 | SB-674042)
Show SMILES Cc1nc(C(=O)N2CCC[C@H]2Cc2nnc(o2)-c2ccccc2)c(s1)-c1ccccc1F |r|
Show InChI InChI=1S/C24H21FN4O2S/c1-15-26-21(22(32-15)18-11-5-6-12-19(18)25)24(30)29-13-7-10-17(29)14-20-27-28-23(31-20)16-8-3-2-4-9-16/h2-6,8-9,11-12,17H,7,10,13-14H2,1H3/t17-/m0/s1
Reactome pathway
3.90n/an/an/an/an/an/an/an/a
TBA
Citation and Details
3D
3D Structure (crystal)
Orexin receptor type 2
(Homo sapiens (Human))
BDBM50423649
(CHEMBL2110363 | CHEMBL2413521 | SB-674042)
Show SMILES Cc1nc(C(=O)N2CCC[C@H]2Cc2nnc(o2)-c2ccccc2)c(s1)-c1ccccc1F |r|
Show InChI InChI=1S/C24H21FN4O2S/c1-15-26-21(22(32-15)18-11-5-6-12-19(18)25)24(30)29-13-7-10-17(29)14-20-27-28-23(31-20)16-8-3-2-4-9-16/h2-6,8-9,11-12,17H,7,10,13-14H2,1H3/t17-/m0/s1
Reactome pathway
129n/an/an/an/an/an/an/an/a
Janssen Research& Development
Curated by ChEMBL
Assay Description
Binding affinity to orexin receptor 2 (unknown origin)
Bioorg Med Chem Lett 23: 4761-9 (2013)
Article DOI: 10.1016/j.bmcl.2013.06.057
BindingDB Entry DOI: 10.7270/Q25140NJ
Orexin receptor type 2
(Homo sapiens (Human))
BDBM50423649
(CHEMBL2110363 | CHEMBL2413521 | SB-674042)
Show SMILES Cc1nc(C(=O)N2CCC[C@H]2Cc2nnc(o2)-c2ccccc2)c(s1)-c1ccccc1F |r|
Show InChI InChI=1S/C24H21FN4O2S/c1-15-26-21(22(32-15)18-11-5-6-12-19(18)25)24(30)29-13-7-10-17(29)14-20-27-28-23(31-20)16-8-3-2-4-9-16/h2-6,8-9,11-12,17H,7,10,13-14H2,1H3/t17-/m0/s1
Reactome pathway
129n/an/an/an/an/an/an/an/a
Janssen Research& Development
Curated by ChEMBL
Assay Description
Binding affinity to orexin receptor 2 (unknown origin)
Bioorg Med Chem Lett 23: 4761-9 (2013)
Article DOI: 10.1016/j.bmcl.2013.06.057
BindingDB Entry DOI: 10.7270/Q25140NJ
Orexin receptor type 1
(Homo sapiens (Human))
BDBM50423649
(CHEMBL2110363 | CHEMBL2413521 | SB-674042)
Show SMILES Cc1nc(C(=O)N2CCC[C@H]2Cc2nnc(o2)-c2ccccc2)c(s1)-c1ccccc1F |r|
Show InChI InChI=1S/C24H21FN4O2S/c1-15-26-21(22(32-15)18-11-5-6-12-19(18)25)24(30)29-13-7-10-17(29)14-20-27-28-23(31-20)16-8-3-2-4-9-16/h2-6,8-9,11-12,17H,7,10,13-14H2,1H3/t17-/m0/s1
Reactome pathway
n/an/an/a 5.10n/an/an/an/an/a
Actelion Pharmaceuticals Ltd.
Curated by ChEMBL
Assay Description
Binding affinity to OX1 receptor
J Med Chem 52: 891-903 (2009)
Article DOI: 10.1021/jm801296d
BindingDB Entry DOI: 10.7270/Q2TM7B3D
3D
3D Structure (crystal)