BDBM50423656 CGP-41251::MIDOSTAURIN::PKC-412
SMILES: CO[C@H]1[C@@H](C[C@H]2O[C@@]1(C)n1c3ccccc3c3c4CNC(=O)c4c4c5ccccc5n2c4c13)N(C)C(=O)c1ccccc1
InChI Key: InChIKey=BMGQWWVMWDBQGC-NEZUGYADSA-N
Data: 1 IC50
Activity Spreadsheet -- Enzyme Inhibition Constant Data from BindingDB
Found 1 hit for monomerid = 50423656
Trg + Lig
Ki
nM
ΔG°
kcal/mole
IC50
nM
Kd
nM
EC50/IC50
nM
koff
s-1
kon
M-1s-1
pHTemp
°C
Macrophage colony stimulating factor receptor
(Homo sapiens (Human))
BDBM50423656
(CGP-41251 | MIDOSTAURIN | PKC-412)
Show SMILES CO[C@H]1[C@@H](C[C@H]2O[C@@]1(C)n1c3ccccc3c3c4CNC(=O)c4c4c5ccccc5n2c4c13)N(C)C(=O)c1ccccc1 |r|
Show InChI InChI=1S/C35H30N4O4/c1-35-32(42-3)25(37(2)34(41)19-11-5-4-6-12-19)17-26(43-35)38-23-15-9-7-13-20(23)28-29-22(18-36-33(29)40)27-21-14-8-10-16-24(21)39(35)31(27)30(28)38/h4-16,25-26,32H,17-18H2,1-3H3,(H,36,40)/t25-,26?,32+,35-/m1/s1
n/an/a 142n/an/an/an/an/an/a
University of Newcastle
Curated by ChEMBL
Assay Description
Inhibition of human FMS expressed in growth factor dependent mouse FDC-P1 cells assessed as inhibition of FMS-mediated cell proliferation in presence...
Bioorg Med Chem 18: 1789-97 (2010)
Article DOI: 10.1016/j.bmc.2010.01.056
BindingDB Entry DOI: 10.7270/Q2CZ383G