null
SMILES: Cc1cc(C)c(C(=O)N[C@@H](CNC(=O)CO[C@H]2C[C@H](CNc3ccccn3)N(C2)C(=O)CC(C)(C)C)C(O)=O)c(C)c1
InChI Key: InChIKey=AZJYXUVHLYXCJY-SGNDLWITSA-N
Activity Spreadsheet -- Enzyme Inhibition Constant Data from BindingDB
Found 4 hits for monomerid = 50423717
Trg + Lig
Ki
nM
ΔG°
kcal/mole
IC50
nM
Kd
nM
EC50/IC50
nM
koff
s-1
kon
M-1s-1
pHTemp
°C
Integrin alpha-IIb/beta-3
(Homo sapiens (Human))
BDBM50423717
(CHEMBL594166)
Show SMILES Cc1cc(C)c(C(=O)N[C@@H](CNC(=O)CO[C@H]2C[C@H](CNc3ccccn3)N(C2)C(=O)CC(C)(C)C)C(O)=O)c(C)c1 |r|
Show InChI InChI=1S/C31H43N5O6/c1-19-11-20(2)28(21(3)12-19)29(39)35-24(30(40)41)16-34-26(37)18-42-23-13-22(15-33-25-9-7-8-10-32-25)36(17-23)27(38)14-31(4,5)6/h7-12,22-24H,13-18H2,1-6H3,(H,32,33)(H,34,37)(H,35,39)(H,40,41)/t22-,23+,24+/m1/s1
n/an/a>5.00E+4n/an/an/an/an/an/a
Jerini AG
Curated by ChEMBL
Assay Description
Binding affinity to integrin alpha2bbeta3 receptor by ELISA
Bioorg Med Chem Lett 20: 380-2 (2010)
Article DOI: 10.1016/j.bmcl.2009.10.073
BindingDB Entry DOI: 10.7270/Q2M61MKQ
Integrin alpha-5/beta-1
(Homo sapiens (Human))
BDBM50423717
(CHEMBL594166)
Show SMILES Cc1cc(C)c(C(=O)N[C@@H](CNC(=O)CO[C@H]2C[C@H](CNc3ccccn3)N(C2)C(=O)CC(C)(C)C)C(O)=O)c(C)c1 |r|
Show InChI InChI=1S/C31H43N5O6/c1-19-11-20(2)28(21(3)12-19)29(39)35-24(30(40)41)16-34-26(37)18-42-23-13-22(15-33-25-9-7-8-10-32-25)36(17-23)27(38)14-31(4,5)6/h7-12,22-24H,13-18H2,1-6H3,(H,32,33)(H,34,37)(H,35,39)(H,40,41)/t22-,23+,24+/m1/s1
n/an/a 1.60n/an/an/an/an/an/a
Jerini AG
Curated by ChEMBL
Assay Description
Binding affinity to integrin alpha5beta1 receptor by ELISA
Bioorg Med Chem Lett 20: 380-2 (2010)
Article DOI: 10.1016/j.bmcl.2009.10.073
BindingDB Entry DOI: 10.7270/Q2M61MKQ
Integrin alpha-V/beta-3
(Homo sapiens (Human))
BDBM50423717
(CHEMBL594166)
Show SMILES Cc1cc(C)c(C(=O)N[C@@H](CNC(=O)CO[C@H]2C[C@H](CNc3ccccn3)N(C2)C(=O)CC(C)(C)C)C(O)=O)c(C)c1 |r|
Show InChI InChI=1S/C31H43N5O6/c1-19-11-20(2)28(21(3)12-19)29(39)35-24(30(40)41)16-34-26(37)18-42-23-13-22(15-33-25-9-7-8-10-32-25)36(17-23)27(38)14-31(4,5)6/h7-12,22-24H,13-18H2,1-6H3,(H,32,33)(H,34,37)(H,35,39)(H,40,41)/t22-,23+,24+/m1/s1
n/an/a 1.60E+4n/an/an/an/an/an/a
Jerini AG
Curated by ChEMBL
Assay Description
Binding affinity to integrin alpha5beta3 receptor by ELISA
Bioorg Med Chem Lett 20: 380-2 (2010)
Article DOI: 10.1016/j.bmcl.2009.10.073
BindingDB Entry DOI: 10.7270/Q2M61MKQ
Integrin alpha-V/beta-5
(Homo sapiens (Human))
BDBM50423717
(CHEMBL594166)
Show SMILES Cc1cc(C)c(C(=O)N[C@@H](CNC(=O)CO[C@H]2C[C@H](CNc3ccccn3)N(C2)C(=O)CC(C)(C)C)C(O)=O)c(C)c1 |r|
Show InChI InChI=1S/C31H43N5O6/c1-19-11-20(2)28(21(3)12-19)29(39)35-24(30(40)41)16-34-26(37)18-42-23-13-22(15-33-25-9-7-8-10-32-25)36(17-23)27(38)14-31(4,5)6/h7-12,22-24H,13-18H2,1-6H3,(H,32,33)(H,34,37)(H,35,39)(H,40,41)/t22-,23+,24+/m1/s1
NCI pathway
Reactome pathway
n/an/a 9.07E+4n/an/an/an/an/an/a
Jerini AG
Curated by ChEMBL
Assay Description
Binding affinity to integrin alpha5beta5 receptor by ELISA
Bioorg Med Chem Lett 20: 380-2 (2010)
Article DOI: 10.1016/j.bmcl.2009.10.073
BindingDB Entry DOI: 10.7270/Q2M61MKQ