BDBM50423871 CHEMBL2024149
SMILES: COc1ccc(cc1)-n1nc2c(NC(=O)CCC(=O)NCCOCCOCCNC(=O)CCCCCNC(=O)COc3ccc([CH+]\C=c4\ccc5=Cc6ccc(-c7cccs7)n6[B-](F)(F)n45)cc3)nc3ccccc3n2c1=O
InChI Key: InChIKey=QZWJAYDEUOWPGW-UKIVNFPFSA-N
Data: 2 Kd
Activity Spreadsheet -- Enzyme Inhibition Constant Data from BindingDB
Found 2 hits for monomerid = 50423871
Trg + Lig
Ki
nM
ΔG°
kcal/mole
IC50
nM
Kd
nM
EC50/IC50
nM
koff
s-1
kon
M-1s-1
pHTemp
°C
Adenosine receptor A1
(Homo sapiens (Human))
BDBM50423871
(CHEMBL2024149)
Show SMILES COc1ccc(cc1)-n1nc2c(NC(=O)CCC(=O)NCCOCCOCCNC(=O)CCCCCNC(=O)COc3ccc([CH+]\C=c4\ccc5=Cc6ccc(-c7cccs7)n6[B-](F)(F)n45)cc3)nc3ccccc3n2c1=O |t:51|
Show InChI InChI=1S/C55H57BF2N10O9S/c1-74-43-23-18-40(19-24-43)68-55(73)65-46-9-5-4-8-45(46)62-53(54(65)64-68)63-51(71)27-26-50(70)61-30-32-76-34-33-75-31-29-60-49(69)11-3-2-6-28-59-52(72)37-77-44-21-13-38(14-22-44)12-15-39-16-17-41-36-42-20-25-47(48-10-7-35-78-48)67(42)56(57,58)66(39)41/h4-5,7-10,12-25,35-36H,2-3,6,11,26-34,37H2,1H3,(H,59,72)(H,60,69)(H,61,70)(H,62,63,71)/b39-15-
Reactome pathway
n/an/an/a 275n/an/an/an/an/a
University of Nottingham
Curated by ChEMBL
Assay Description
Antagonist activity at human adenosine A1 receptor expressed in CHO cells assessed as inhibition of NECA-induced increase of intracellular cAMP level...
J Med Chem 55: 1771-82 (2012)
Article DOI: 10.1021/jm201722y
BindingDB Entry DOI: 10.7270/Q2ST7R4K
Adenosine receptor A3
(Homo sapiens (Human))
BDBM50423871
(CHEMBL2024149)
Show SMILES COc1ccc(cc1)-n1nc2c(NC(=O)CCC(=O)NCCOCCOCCNC(=O)CCCCCNC(=O)COc3ccc([CH+]\C=c4\ccc5=Cc6ccc(-c7cccs7)n6[B-](F)(F)n45)cc3)nc3ccccc3n2c1=O |t:51|
Show InChI InChI=1S/C55H57BF2N10O9S/c1-74-43-23-18-40(19-24-43)68-55(73)65-46-9-5-4-8-45(46)62-53(54(65)64-68)63-51(71)27-26-50(70)61-30-32-76-34-33-75-31-29-60-49(69)11-3-2-6-28-59-52(72)37-77-44-21-13-38(14-22-44)12-15-39-16-17-41-36-42-20-25-47(48-10-7-35-78-48)67(42)56(57,58)66(39)41/h4-5,7-10,12-25,35-36H,2-3,6,11,26-34,37H2,1H3,(H,59,72)(H,60,69)(H,61,70)(H,62,63,71)/b39-15-
Reactome pathway
n/an/an/a 0.437n/an/an/an/an/a
University of Nottingham
Curated by ChEMBL
Assay Description
Antagonist activity at human adenosine A3 receptor expressed in forskolin-stimulated CHO cells assessed as inhibition of NECA-induced CRE-SPAP gene t...
J Med Chem 55: 1771-82 (2012)
Article DOI: 10.1021/jm201722y
BindingDB Entry DOI: 10.7270/Q2ST7R4K