BDBM50423942 CHEMBL2313402
SMILES: Cc1nc2sc(C(=O)NC3CCOC3)c(N)c2c(C)c1Cl
InChI Key: InChIKey=PEZABYICBULKQF-UHFFFAOYSA-N
Data: 1 EC50
Activity Spreadsheet -- Enzyme Inhibition Constant Data from BindingDB
Found 1 hit for monomerid = 50423942
Trg + Lig
Ki
nM
ΔG°
kcal/mole
IC50
nM
Kd
nM
EC50/IC50
nM
koff
s-1
kon
M-1s-1
pHTemp
°C
Muscarinic acetylcholine receptor M4
(Homo sapiens (Human))
BDBM50423942
(CHEMBL2313402)
Show SMILES Cc1nc2sc(C(=O)NC3CCOC3)c(N)c2c(C)c1Cl
Show InChI InChI=1S/C14H16ClN3O2S/c1-6-9-11(16)12(13(19)18-8-3-4-20-5-8)21-14(9)17-7(2)10(6)15/h8H,3-5,16H2,1-2H3,(H,18,19)
Reactome pathway
n/an/an/an/a 52n/an/an/an/a
Vanderbilt University Medical Center
Curated by ChEMBL
Assay Description
Positive allosteric modulation of human muscarinic M4 receptor expressed in CHO-K1 cells assessed as leftward shift in acetylcholine response treated...
Bioorg Med Chem Lett 23: 346-50 (2012)
Article DOI: 10.1016/j.bmcl.2012.10.073
BindingDB Entry DOI: 10.7270/Q2N29Z8S