BDBM50424054 CHEMBL2314720
SMILES: COc1cc2cc(C(=O)OC3CCN(Cc4ccccc4)CC3)c(=O)oc2cc1OC
InChI Key: InChIKey=DEPJXHIWXNSOTK-UHFFFAOYSA-N
Data: 1 IC50
Activity Spreadsheet -- Enzyme Inhibition Constant Data from BindingDB
Found 1 hit for monomerid = 50424054
Trg + Lig
Ki
nM
ΔG°
kcal/mole
IC50
nM
Kd
nM
EC50/IC50
nM
koff
s-1
kon
M-1s-1
pHTemp
°C
Acetylcholinesterase
(Bos taurus (bovine))
BDBM50424054
(CHEMBL2314720)
Show SMILES COc1cc2cc(C(=O)OC3CCN(Cc4ccccc4)CC3)c(=O)oc2cc1OC
Show InChI InChI=1S/C24H25NO6/c1-28-21-13-17-12-19(24(27)31-20(17)14-22(21)29-2)23(26)30-18-8-10-25(11-9-18)15-16-6-4-3-5-7-16/h3-7,12-14,18H,8-11,15H2,1-2H3
Reactome pathway
n/an/a 14n/an/an/an/an/an/a
Universit£ degli Studi di Bari Aldo Moro
Curated by ChEMBL
Assay Description
Inhibition of bovine acetylcholinesterase using acetylcholine iodide as substrate incubated for 20 mins prior to substrate addition meausred after 3 ...
Bioorg Med Chem 21: 146-52 (2012)
Article DOI: 10.1016/j.bmc.2012.10.045
BindingDB Entry DOI: 10.7270/Q2QV3NTH