BDBM50424076 CHEMBL2314745
SMILES: COc1ccc2CC3N(CCc4cc(OC)c(OC)cc34)Cc2c1O
InChI Key: InChIKey=DKBYSDUFSXFXMP-UHFFFAOYSA-N
Data: 3 IC50
Activity Spreadsheet -- Enzyme Inhibition Constant Data from BindingDB
Found 3 hits for monomerid = 50424076
Trg + Lig
Ki
nM
ΔG°
kcal/mole
IC50
nM
Kd
nM
EC50/IC50
nM
koff
s-1
kon
M-1s-1
pHTemp
°C
Coagulation factor VII/tissue factor
(Homo sapiens (Human))
BDBM50424076
(CHEMBL2314745)
Show SMILES COc1ccc2CC3N(CCc4cc(OC)c(OC)cc34)Cc2c1O
Show InChI InChI=1S/C20H23NO4/c1-23-17-5-4-12-8-16-14-10-19(25-3)18(24-2)9-13(14)6-7-21(16)11-15(12)20(17)22/h4-5,9-10,16,22H,6-8,11H2,1-3H3
Reactome pathway
n/an/a 187n/an/an/an/an/an/a
China Pharmaceutical University
Curated by ChEMBL
Assay Description
Inhibition of tissue factor procoagulant activity in LPS-stimulated human THP1 cells preincubated for 1 hr before LPS addition measured after 5 hrs
Bioorg Med Chem 21: 62-9 (2012)
Article DOI: 10.1016/j.bmc.2012.11.002
BindingDB Entry DOI: 10.7270/Q2M32X22
D(2) dopamine receptor
(Homo sapiens (Human))
BDBM50424076
(CHEMBL2314745)
Show SMILES COc1ccc2CC3N(CCc4cc(OC)c(OC)cc34)Cc2c1O
Show InChI InChI=1S/C20H23NO4/c1-23-17-5-4-12-8-16-14-10-19(25-3)18(24-2)9-13(14)6-7-21(16)11-15(12)20(17)22/h4-5,9-10,16,22H,6-8,11H2,1-3H3
Reactome pathway
n/an/a 3.11E+3n/an/an/an/an/an/a
Huzhou University
Curated by ChEMBL
Assay Description
Antagonist activity at D2 receptor (unknown origin) expressed in CHOK1 cells assessed as inhibition of dopamine-induced calcium flux preincubated for...
Bioorg Med Chem 27: 2100-2111 (2019)
Article DOI: 10.1016/j.bmc.2019.04.014
D(1A) dopamine receptor
(Homo sapiens (Human))
BDBM50424076
(CHEMBL2314745)
Show SMILES COc1ccc2CC3N(CCc4cc(OC)c(OC)cc34)Cc2c1O
Show InChI InChI=1S/C20H23NO4/c1-23-17-5-4-12-8-16-14-10-19(25-3)18(24-2)9-13(14)6-7-21(16)11-15(12)20(17)22/h4-5,9-10,16,22H,6-8,11H2,1-3H3
n/an/a 410n/an/an/an/an/an/a
Huzhou University
Curated by ChEMBL
Assay Description
Antagonist activity at D1 receptor (unknown origin) expressed in CHOK1 cells assessed as inhibition of SKF38393-induced cAMP accumulation measured af...
Bioorg Med Chem 27: 2100-2111 (2019)
Article DOI: 10.1016/j.bmc.2019.04.014