BDBM50424264 CHEMBL2314464
SMILES: CC(C)[C@H](CO)Nc1nc(Nc2ccncc2)c2ncn(C(C)C)c2n1
InChI Key: InChIKey=NCBDOQFSGNRAHL-AWEZNQCLSA-N
Data: 2 IC50
Activity Spreadsheet -- Enzyme Inhibition Constant Data from BindingDB
Found 2 hits for monomerid = 50424264
Trg + Lig
Ki
nM
ΔG°
kcal/mole
IC50
nM
Kd
nM
EC50/IC50
nM
koff
s-1
kon
M-1s-1
pHTemp
°C
Cyclin-Dependent Kinase 5 (CDK5)
(Homo sapiens (Human))
BDBM50424264
(CHEMBL2314464)
Show SMILES CC(C)[C@H](CO)Nc1nc(Nc2ccncc2)c2ncn(C(C)C)c2n1 |r|
Show InChI InChI=1S/C18H25N7O/c1-11(2)14(9-26)22-18-23-16(21-13-5-7-19-8-6-13)15-17(24-18)25(10-20-15)12(3)4/h5-8,10-12,14,26H,9H2,1-4H3,(H2,19,21,22,23,24)/t14-/m0/s1
NCI pathway
Reactome pathway
n/an/a 21n/an/an/an/an/an/a
Universit£ Paris Descartes
Curated by ChEMBL
Assay Description
Inhibition of recombinant human CDK5/p25 after 30 mins by scintillation counting
Bioorg Med Chem Lett 23: 125-31 (2012)
Article DOI: 10.1016/j.bmcl.2012.10.141
BindingDB Entry DOI: 10.7270/Q2J38TVS
Dual-specificity tyrosine-phosphorylation regulated kinase 1A
(Homo sapiens (Human))
BDBM50424264
(CHEMBL2314464)
Show SMILES CC(C)[C@H](CO)Nc1nc(Nc2ccncc2)c2ncn(C(C)C)c2n1 |r|
Show InChI InChI=1S/C18H25N7O/c1-11(2)14(9-26)22-18-23-16(21-13-5-7-19-8-6-13)15-17(24-18)25(10-20-15)12(3)4/h5-8,10-12,14,26H,9H2,1-4H3,(H2,19,21,22,23,24)/t14-/m0/s1
Reactome pathway
n/an/a 780n/an/an/an/an/an/a
Universit£ Paris Descartes
Curated by ChEMBL
Assay Description
Inhibition of recombinant GST-fused human DYRK1A expressed in Escherichia coli using KKISGRLSPIMTEQ as substrate
Bioorg Med Chem Lett 23: 125-31 (2012)
Article DOI: 10.1016/j.bmcl.2012.10.141
BindingDB Entry DOI: 10.7270/Q2J38TVS