null
SMILES: OCC(=O)c1ccc(cc1)-c1ccc(OCc2nnc(SC3CCCC3)n2-c2cccnc2)cc1
InChI Key: InChIKey=UWDXXPBXXHGOIJ-UHFFFAOYSA-N
Activity Spreadsheet -- Enzyme Inhibition Constant Data from BindingDB
Found 1 hit for monomerid = 50424941
Trg + Lig
Ki
nM
ΔG°
kcal/mole
IC50
nM
Kd
nM
EC50/IC50
nM
koff
s-1
kon
M-1s-1
pHTemp
°C
Transitional endoplasmic reticulum ATPase
(Homo sapiens (Human))
BDBM50424941
(CHEMBL2315428)
Show SMILES OCC(=O)c1ccc(cc1)-c1ccc(OCc2nnc(SC3CCCC3)n2-c2cccnc2)cc1
Show InChI InChI=1S/C27H26N4O3S/c32-17-25(33)21-9-7-19(8-10-21)20-11-13-23(14-12-20)34-18-26-29-30-27(35-24-5-1-2-6-24)31(26)22-4-3-15-28-16-22/h3-4,7-16,24,32H,1-2,5-6,17-18H2
n/an/a 48n/an/an/an/an/an/a
TBA
Curated by ChEMBL
Assay Description
Inhibition of human recombinant His-GST tagged VCP expressed in baculovirus infected Hi5 cells assessed as ADP formation incubated for 20 mins proir ...
J Med Chem 56: 437-50 (2013)
Article DOI: 10.1021/jm3013213
BindingDB Entry DOI: 10.7270/Q21Z45QK