BDBM50424942 CHEMBL2315427
SMILES: CONC(=O)c1ccc(cc1)-c1ccc(OCc2nnc(SC3CCCC3)n2-c2cccnc2)cc1
InChI Key: InChIKey=OYWOVBCRJWLXTD-UHFFFAOYSA-N
Data: 1 IC50
Activity Spreadsheet -- Enzyme Inhibition Constant Data from BindingDB
Found 1 hit for monomerid = 50424942
Trg + Lig
Ki
nM
ΔG°
kcal/mole
IC50
nM
Kd
nM
EC50/IC50
nM
koff
s-1
kon
M-1s-1
pHTemp
°C
Transitional endoplasmic reticulum ATPase
(Homo sapiens (Human))
BDBM50424942
(CHEMBL2315427)
Show SMILES CONC(=O)c1ccc(cc1)-c1ccc(OCc2nnc(SC3CCCC3)n2-c2cccnc2)cc1
Show InChI InChI=1S/C27H27N5O3S/c1-34-31-26(33)21-10-8-19(9-11-21)20-12-14-23(15-13-20)35-18-25-29-30-27(36-24-6-2-3-7-24)32(25)22-5-4-16-28-17-22/h4-5,8-17,24H,2-3,6-7,18H2,1H3,(H,31,33)
n/an/a 43n/an/an/an/an/an/a
TBA
Curated by ChEMBL
Assay Description
Inhibition of human recombinant His-GST tagged VCP expressed in baculovirus infected Hi5 cells assessed as ADP formation incubated for 20 mins proir ...
J Med Chem 56: 437-50 (2013)
Article DOI: 10.1021/jm3013213
BindingDB Entry DOI: 10.7270/Q21Z45QK