BDBM50425094 CHEMBL2312920
SMILES: CCCN(c1cccc(c1)C#N)P(=O)(c1ccccc1)c1ccccc1
InChI Key: InChIKey=YVQQXCIARSSGNM-UHFFFAOYSA-N
Data: 3 IC50
Activity Spreadsheet -- Enzyme Inhibition Constant Data from BindingDB
Found 3 hits for monomerid = 50425094
Trg + Lig
Ki
nM
ΔG°
kcal/mole
IC50
nM
Kd
nM
EC50/IC50
nM
koff
s-1
kon
M-1s-1
pHTemp
°C
Potassium voltage-gated channel subfamily H member 2
(Homo sapiens (Human))
BDBM50425094
(CHEMBL2312920)
Show SMILES CCCN(c1cccc(c1)C#N)P(=O)(c1ccccc1)c1ccccc1
Show InChI InChI=1S/C22H21N2OP/c1-2-16-24(20-11-9-10-19(17-20)18-23)26(25,21-12-5-3-6-13-21)22-14-7-4-8-15-22/h3-15,17H,2,16H2,1H3
Reactome pathway
n/an/a>3.30E+4n/an/an/an/an/an/a
AstraZeneca
Curated by ChEMBL
Assay Description
Inhibition of human ERG
Bioorg Med Chem Lett 23: 706-10 (2013)
Article DOI: 10.1016/j.bmcl.2012.11.098
BindingDB Entry DOI: 10.7270/Q2H133BG
Voltage-gated potassium channel subunit Kv1.5
(Homo sapiens (Human))
BDBM50425094
(CHEMBL2312920)
Show SMILES CCCN(c1cccc(c1)C#N)P(=O)(c1ccccc1)c1ccccc1
Show InChI InChI=1S/C22H21N2OP/c1-2-16-24(20-11-9-10-19(17-20)18-23)26(25,21-12-5-3-6-13-21)22-14-7-4-8-15-22/h3-15,17H,2,16H2,1H3
n/an/a 200n/an/an/an/an/an/a
AstraZeneca
Curated by ChEMBL
Assay Description
Inhibition of human Kv1.5 channel expressed in CHO cells by high throughput planar patch clamp assay
Bioorg Med Chem Lett 23: 706-10 (2013)
Article DOI: 10.1016/j.bmcl.2012.11.098
BindingDB Entry DOI: 10.7270/Q2H133BG
Intermediate conductance calcium-activated potassium channel protein 4
(Homo sapiens (Human))
BDBM50425094
(CHEMBL2312920)
Show SMILES CCCN(c1cccc(c1)C#N)P(=O)(c1ccccc1)c1ccccc1
Show InChI InChI=1S/C22H21N2OP/c1-2-16-24(20-11-9-10-19(17-20)18-23)26(25,21-12-5-3-6-13-21)22-14-7-4-8-15-22/h3-15,17H,2,16H2,1H3
Reactome pathway
n/an/a 2.70E+3n/an/an/an/an/an/a
AstraZeneca
Curated by ChEMBL
Assay Description
Inhibition of IK channel (unknown origin)
Bioorg Med Chem Lett 23: 706-10 (2013)
Article DOI: 10.1016/j.bmcl.2012.11.098
BindingDB Entry DOI: 10.7270/Q2H133BG