BDBM50425111 CHEMBL2312926::Rac-3-((Diphenylphosphoryl)(Phenyl)Methyl)Pyridine
SMILES: O=P(C(c1ccccc1)c1cccnc1)(c1ccccc1)c1ccccc1
InChI Key: InChIKey=QWDDTOMERKJRQK-UHFFFAOYSA-N
Data: 2 IC50
Activity Spreadsheet -- Enzyme Inhibition Constant Data from BindingDB
Found 2 hits for monomerid = 50425111
Trg + Lig
Ki
nM
ΔG°
kcal/mole
IC50
nM
Kd
nM
EC50/IC50
nM
koff
s-1
kon
M-1s-1
pHTemp
°C
Voltage-gated potassium channel subunit Kv1.5
(Homo sapiens (Human))
BDBM50425111
(CHEMBL2312926 | Rac-3-((Diphenylphosphoryl)(Phenyl...)
Show SMILES O=P(C(c1ccccc1)c1cccnc1)(c1ccccc1)c1ccccc1
Show InChI InChI=1S/C24H20NOP/c26-27(22-14-6-2-7-15-22,23-16-8-3-9-17-23)24(20-11-4-1-5-12-20)21-13-10-18-25-19-21/h1-19,24H
n/an/a 100n/an/an/an/an/an/a
AstraZeneca
Curated by ChEMBL
Assay Description
Inhibition of human Kv1.5 channel expressed in CHO cells by high throughput planar patch clamp assay
Bioorg Med Chem Lett 23: 706-10 (2013)
Article DOI: 10.1016/j.bmcl.2012.11.098
BindingDB Entry DOI: 10.7270/Q2H133BG
Intermediate conductance calcium-activated potassium channel protein 4
(Homo sapiens (Human))
BDBM50425111
(CHEMBL2312926 | Rac-3-((Diphenylphosphoryl)(Phenyl...)
Show SMILES O=P(C(c1ccccc1)c1cccnc1)(c1ccccc1)c1ccccc1
Show InChI InChI=1S/C24H20NOP/c26-27(22-14-6-2-7-15-22,23-16-8-3-9-17-23)24(20-11-4-1-5-12-20)21-13-10-18-25-19-21/h1-19,24H
Reactome pathway
n/an/a 500n/an/an/an/an/an/a
AstraZeneca
Curated by ChEMBL
Assay Description
Inhibition of IK channel (unknown origin)
Bioorg Med Chem Lett 23: 706-10 (2013)
Article DOI: 10.1016/j.bmcl.2012.11.098
BindingDB Entry DOI: 10.7270/Q2H133BG