null
SMILES: C(N1CCCCC1)c1cc2ccc(Oc3nc4ncccc4s3)cc2o1
InChI Key: InChIKey=SHQARKWHJUQQBE-UHFFFAOYSA-N
Activity Spreadsheet -- Enzyme Inhibition Constant Data from BindingDB
Found 2 hits for monomerid = 50425152
Trg + Lig
Ki
nM
ΔG°
kcal/mole
IC50
nM
Kd
nM
EC50/IC50
nM
koff
s-1
kon
M-1s-1
pHTemp
°C
Leukotriene A-4 hydrolase
(Homo sapiens (Human))
BDBM50425152
(CHEMBL2313562)
Show SMILES C(N1CCCCC1)c1cc2ccc(Oc3nc4ncccc4s3)cc2o1
Show InChI InChI=1S/C20H19N3O2S/c1-2-9-23(10-3-1)13-16-11-14-6-7-15(12-17(14)24-16)25-20-22-19-18(26-20)5-4-8-21-19/h4-8,11-12H,1-3,9-10,13H2
Reactome pathway
n/an/a 51n/an/an/an/an/an/a
Janssen Research& Development, LLC
Curated by ChEMBL
Assay Description
Inhibition of recombinant human LTA4H expressed in Sf9 cells using LTA4 as substrate incubated for 10 mins prior to substrate addition measured after...
Bioorg Med Chem Lett 23: 811-5 (2013)
Article DOI: 10.1016/j.bmcl.2012.11.074
BindingDB Entry DOI: 10.7270/Q27H1KW1
Leukotriene A-4 hydrolase
(Mus musculus)
BDBM50425152
(CHEMBL2313562)
Show SMILES C(N1CCCCC1)c1cc2ccc(Oc3nc4ncccc4s3)cc2o1
Show InChI InChI=1S/C20H19N3O2S/c1-2-9-23(10-3-1)13-16-11-14-6-7-15(12-17(14)24-16)25-20-22-19-18(26-20)5-4-8-21-19/h4-8,11-12H,1-3,9-10,13H2
n/an/a 140n/an/an/an/an/an/a
Janssen Research& Development, LLC
Curated by ChEMBL
Assay Description
Inhibition of LTA4H in CD1 mouse whole blood assessed as decrease in calcium ionophore-stimulated LTB4 production incubated for 15 mins prior to calc...
Bioorg Med Chem Lett 23: 811-5 (2013)
Article DOI: 10.1016/j.bmcl.2012.11.074
BindingDB Entry DOI: 10.7270/Q27H1KW1