BDBM50425177 CHEMBL2313589
SMILES: CSC(CC(=O)c1ccc(F)cc1)=Nc1nc2ccccc2s1
InChI Key: InChIKey=WCOAKSOFJFGPJA-UHFFFAOYSA-N
Data: 1 IC50
Activity Spreadsheet -- Enzyme Inhibition Constant Data from BindingDB
Found 1 hit for monomerid = 50425177
Trg + Lig
Ki
nM
ΔG°
kcal/mole
IC50
nM
Kd
nM
EC50/IC50
nM
koff
s-1
kon
M-1s-1
pHTemp
°C
Pancreatic alpha-amylase
(Sus scrofa (Pig))
BDBM50425177
(CHEMBL2313589)
Show SMILES CSC(CC(=O)c1ccc(F)cc1)=Nc1nc2ccccc2s1 |w:13.14|
Show InChI InChI=1S/C17H13FN2OS2/c1-22-16(10-14(21)11-6-8-12(18)9-7-11)20-17-19-13-4-2-3-5-15(13)23-17/h2-9H,10H2,1H3
n/an/a 1.99E+4n/an/an/an/an/an/a
North Maharashtra University
Curated by ChEMBL
Assay Description
Inhibition of pig pancreatic alpha-amylase by Bernfeld method
Eur J Med Chem 59: 304-9 (2013)
Article DOI: 10.1016/j.ejmech.2012.11.020
BindingDB Entry DOI: 10.7270/Q2028SV2