BDBM50425335 CHEMBL2315873
SMILES: Clc1ccc2oc(nc2c1)N1CCN(CC1)C(=O)NC1CCCC1
InChI Key: InChIKey=KHILWEMMFZYLOM-UHFFFAOYSA-N
Data: 1 IC50
Activity Spreadsheet -- Enzyme Inhibition Constant Data from BindingDB
Found 1 hit for monomerid = 50425335
Trg + Lig
Ki
nM
ΔG°
kcal/mole
IC50
nM
Kd
nM
EC50/IC50
nM
koff
s-1
kon
M-1s-1
pHTemp
°C
Prostaglandin E synthase
(Homo sapiens (Human))
BDBM50425335
(CHEMBL2315873)
Show SMILES Clc1ccc2oc(nc2c1)N1CCN(CC1)C(=O)NC1CCCC1
Show InChI InChI=1S/C17H21ClN4O2/c18-12-5-6-15-14(11-12)20-17(24-15)22-9-7-21(8-10-22)16(23)19-13-3-1-2-4-13/h5-6,11,13H,1-4,7-10H2,(H,19,23)
Reactome pathway
n/an/a>1.00E+4n/an/an/an/an/an/a
Pfizer Inc.
Curated by ChEMBL
Assay Description
Inhibition of human recombinant mPGES-1 using PGH2 as substrate incubated 20 mins prior to substrate addition measured after 30 secs by EIA
Bioorg Med Chem Lett 23: 907-11 (2013)
Article DOI: 10.1016/j.bmcl.2012.10.040
BindingDB Entry DOI: 10.7270/Q2Z3210H