BDBM50425344 CHEMBL2316205
SMILES: OCCOC(=O)c1ccc2CCc3cc(Nc4ccc(F)cc4F)ccc3C(=O)c2c1
InChI Key: InChIKey=FJFRBMVKHFUJHL-UHFFFAOYSA-N
Data: 2 IC50
Activity Spreadsheet -- Enzyme Inhibition Constant Data from BindingDB
Found 2 hits for monomerid = 50425344
Trg + Lig
Ki
nM
ΔG°
kcal/mole
IC50
nM
Kd
nM
EC50/IC50
nM
koff
s-1
kon
M-1s-1
pHTemp
°C
Mitogen-activated protein kinase 14
(Homo sapiens (Human))
BDBM50425344
(CHEMBL2316205)
Show SMILES OCCOC(=O)c1ccc2CCc3cc(Nc4ccc(F)cc4F)ccc3C(=O)c2c1
Show InChI InChI=1S/C24H19F2NO4/c25-17-5-8-22(21(26)13-17)27-18-6-7-19-15(11-18)3-1-14-2-4-16(12-20(14)23(19)29)24(30)31-10-9-28/h2,4-8,11-13,27-28H,1,3,9-10H2
NCI pathway
Reactome pathway
n/an/a 210n/an/an/an/an/an/a
University of T£bingen
Curated by ChEMBL
Assay Description
Inhibition of p38alpha MAP kinase in whole blood (unknown origin) assessed as lipopolysaccharide-stimulated TNF-alpha release by ELISA
J Med Chem 56: 241-53 (2013)
Article DOI: 10.1021/jm301539x
BindingDB Entry DOI: 10.7270/Q2TB187B
Mitogen-activated protein kinase 14
(Homo sapiens (Human))
BDBM50425344
(CHEMBL2316205)
Show SMILES OCCOC(=O)c1ccc2CCc3cc(Nc4ccc(F)cc4F)ccc3C(=O)c2c1
Show InChI InChI=1S/C24H19F2NO4/c25-17-5-8-22(21(26)13-17)27-18-6-7-19-15(11-18)3-1-14-2-4-16(12-20(14)23(19)29)24(30)31-10-9-28/h2,4-8,11-13,27-28H,1,3,9-10H2
NCI pathway
Reactome pathway
n/an/a 2n/an/an/an/an/an/a
University of T£bingen
Curated by ChEMBL
Assay Description
Inhibition of p38alpha MAP kinase (unknown origin) by ELISA
J Med Chem 56: 241-53 (2013)
Article DOI: 10.1021/jm301539x
BindingDB Entry DOI: 10.7270/Q2TB187B