null
SMILES: CN(c1ncccc1CNc1c(cnc2[nH]c(cc12)-c1ccc(F)cc1)C(F)(F)F)S(C)(=O)=O
InChI Key: InChIKey=UCQJUBOMLHYQTJ-UHFFFAOYSA-N
Activity Spreadsheet -- Enzyme Inhibition Constant Data from BindingDB
Found 3 hits for monomerid = 50425672
Trg + Lig
Ki
nM
ΔG°
kcal/mole
IC50
nM
Kd
nM
EC50/IC50
nM
koff
s-1
kon
M-1s-1
pHTemp
°C
Focal adhesion kinase 1
(Homo sapiens (Human))
BDBM50425672
(CHEMBL2315584)
Show SMILES CN(c1ncccc1CNc1c(cnc2[nH]c(cc12)-c1ccc(F)cc1)C(F)(F)F)S(C)(=O)=O
Show InChI InChI=1S/C22H19F4N5O2S/c1-31(34(2,32)33)21-14(4-3-9-27-21)11-28-19-16-10-18(13-5-7-15(23)8-6-13)30-20(16)29-12-17(19)22(24,25)26/h3-10,12H,11H2,1-2H3,(H2,28,29,30)
NCI pathway
Reactome pathway
n/an/a 2.02E+3n/an/an/an/an/an/a
Merck Serono Research
Curated by ChEMBL
Assay Description
Inhibition of FAK in human HT-29 cells assessed as phosphorylation at tyrosine 397 after 45 mins
J Med Chem 56: 1160-70 (2013)
Article DOI: 10.1021/jm3016014
BindingDB Entry DOI: 10.7270/Q2GT5PGP
Focal adhesion kinase 1
(Homo sapiens (Human))
BDBM50425672
(CHEMBL2315584)
Show SMILES CN(c1ncccc1CNc1c(cnc2[nH]c(cc12)-c1ccc(F)cc1)C(F)(F)F)S(C)(=O)=O
Show InChI InChI=1S/C22H19F4N5O2S/c1-31(34(2,32)33)21-14(4-3-9-27-21)11-28-19-16-10-18(13-5-7-15(23)8-6-13)30-20(16)29-12-17(19)22(24,25)26/h3-10,12H,11H2,1-2H3,(H2,28,29,30)
NCI pathway
Reactome pathway
n/an/an/a 24n/an/an/an/an/a
Merck Serono Research
Curated by ChEMBL
Assay Description
Binding affinity to FAK (unknown origin) by surface plasmon resonance analysis
J Med Chem 56: 1160-70 (2013)
Article DOI: 10.1021/jm3016014
BindingDB Entry DOI: 10.7270/Q2GT5PGP
Focal adhesion kinase 1
(Homo sapiens (Human))
BDBM50425672
(CHEMBL2315584)
Show SMILES CN(c1ncccc1CNc1c(cnc2[nH]c(cc12)-c1ccc(F)cc1)C(F)(F)F)S(C)(=O)=O
Show InChI InChI=1S/C22H19F4N5O2S/c1-31(34(2,32)33)21-14(4-3-9-27-21)11-28-19-16-10-18(13-5-7-15(23)8-6-13)30-20(16)29-12-17(19)22(24,25)26/h3-10,12H,11H2,1-2H3,(H2,28,29,30)
NCI pathway
Reactome pathway
n/an/a 37n/an/an/an/an/an/a
Merck Serono Research
Curated by ChEMBL
Assay Description
Inhibition of FAK (unknown origin) using biotinylated His-TEV-hsFAK(31-686)(K454R) substrate after 2 hrs by scintillation counting analysis
J Med Chem 56: 1160-70 (2013)
Article DOI: 10.1021/jm3016014
BindingDB Entry DOI: 10.7270/Q2GT5PGP