null
SMILES: CN(c1ncccc1CNc1c(cnc2nc([nH]c12)-c1ccc(F)cc1)C(F)(F)F)S(C)(=O)=O
InChI Key: InChIKey=QFOLECLBPGWVBV-UHFFFAOYSA-N
Activity Spreadsheet -- Enzyme Inhibition Constant Data from BindingDB
Found 3 hits for monomerid = 50425685
Trg + Lig
Ki
nM
ΔG°
kcal/mole
IC50
nM
Kd
nM
EC50/IC50
nM
koff
s-1
kon
M-1s-1
pHTemp
°C
Focal adhesion kinase 1
(Homo sapiens (Human))
BDBM50425685
(CHEMBL2315572)
Show SMILES CN(c1ncccc1CNc1c(cnc2nc([nH]c12)-c1ccc(F)cc1)C(F)(F)F)S(C)(=O)=O
Show InChI InChI=1S/C21H18F4N6O2S/c1-31(34(2,32)33)20-13(4-3-9-26-20)10-27-16-15(21(23,24)25)11-28-19-17(16)29-18(30-19)12-5-7-14(22)8-6-12/h3-9,11H,10H2,1-2H3,(H2,27,28,29,30)
NCI pathway
Reactome pathway
n/an/a 130n/an/an/an/an/an/a
Merck Serono Research
Curated by ChEMBL
Assay Description
Inhibition of FAK (unknown origin) using biotinylated His-TEV-hsFAK(31-686)(K454R) substrate after 2 hrs by scintillation counting analysis
J Med Chem 56: 1160-70 (2013)
Article DOI: 10.1021/jm3016014
BindingDB Entry DOI: 10.7270/Q2GT5PGP
Focal adhesion kinase 1
(Homo sapiens (Human))
BDBM50425685
(CHEMBL2315572)
Show SMILES CN(c1ncccc1CNc1c(cnc2nc([nH]c12)-c1ccc(F)cc1)C(F)(F)F)S(C)(=O)=O
Show InChI InChI=1S/C21H18F4N6O2S/c1-31(34(2,32)33)20-13(4-3-9-26-20)10-27-16-15(21(23,24)25)11-28-19-17(16)29-18(30-19)12-5-7-14(22)8-6-12/h3-9,11H,10H2,1-2H3,(H2,27,28,29,30)
NCI pathway
Reactome pathway
n/an/a>1.00E+4n/an/an/an/an/an/a
Merck Serono Research
Curated by ChEMBL
Assay Description
Inhibition of FAK in human HT-29 cells assessed as phosphorylation at tyrosine 397 after 45 mins
J Med Chem 56: 1160-70 (2013)
Article DOI: 10.1021/jm3016014
BindingDB Entry DOI: 10.7270/Q2GT5PGP
Focal adhesion kinase 1
(Homo sapiens (Human))
BDBM50425685
(CHEMBL2315572)
Show SMILES CN(c1ncccc1CNc1c(cnc2nc([nH]c12)-c1ccc(F)cc1)C(F)(F)F)S(C)(=O)=O
Show InChI InChI=1S/C21H18F4N6O2S/c1-31(34(2,32)33)20-13(4-3-9-26-20)10-27-16-15(21(23,24)25)11-28-19-17(16)29-18(30-19)12-5-7-14(22)8-6-12/h3-9,11H,10H2,1-2H3,(H2,27,28,29,30)
NCI pathway
Reactome pathway
n/an/an/a 33n/an/an/an/an/a
Merck Serono Research
Curated by ChEMBL
Assay Description
Binding affinity to FAK (unknown origin) by surface plasmon resonance analysis
J Med Chem 56: 1160-70 (2013)
Article DOI: 10.1021/jm3016014
BindingDB Entry DOI: 10.7270/Q2GT5PGP