null
SMILES: CC(C)OC(=O)Cn1c(SCCOc2ccc(C)cc2)nc2ccccc12
InChI Key: InChIKey=ZXLCHOFBIGWOBF-UHFFFAOYSA-N
Activity Spreadsheet -- Enzyme Inhibition Constant Data from BindingDB
Found 1 hit for monomerid = 50425779
Trg + Lig
Ki
nM
ΔG°
kcal/mole
IC50
nM
Kd
nM
EC50/IC50
nM
koff
s-1
kon
M-1s-1
pHTemp
°C
Androgen receptor
(Homo sapiens (Human))
BDBM50425779
(CHEMBL2316559)
Show SMILES CC(C)OC(=O)Cn1c(SCCOc2ccc(C)cc2)nc2ccccc12
Show InChI InChI=1S/C21H24N2O3S/c1-15(2)26-20(24)14-23-19-7-5-4-6-18(19)22-21(23)27-13-12-25-17-10-8-16(3)9-11-17/h4-11,15H,12-14H2,1-3H3
NCI pathway
Reactome pathway
n/an/a 1.11E+4n/an/an/an/an/an/a
University of British Columbia
Curated by ChEMBL
Assay Description
Inhibition of BF3 site of androgen receptor in human LNCAP cells expressing ARR2PB after 3 days by eGFP transcriptional assay
J Med Chem 56: 1136-48 (2013)
Article DOI: 10.1021/jm3015712
BindingDB Entry DOI: 10.7270/Q2ZW1N7N