BDBM50425816 CHEMBL2316910
SMILES: OC(=O)c1cc2c(C#Cc3ccc(F)cc3F)c(oc2cc1O)-c1ccccc1
InChI Key: InChIKey=XLDWFNORYRAUDE-UHFFFAOYSA-N
Data: 9 IC50
Activity Spreadsheet -- Enzyme Inhibition Constant Data from BindingDB
Found 9 hits for monomerid = 50425816
Trg + Lig
Ki
nM
ΔG°
kcal/mole
IC50
nM
Kd
nM
EC50/IC50
nM
koff
s-1
kon
M-1s-1
pHTemp
°C
Dual specificity protein phosphatase (VHR)
(Homo sapiens (Human))
BDBM50425816
(CHEMBL2316910)
Show SMILES OC(=O)c1cc2c(C#Cc3ccc(F)cc3F)c(oc2cc1O)-c1ccccc1
Show InChI InChI=1S/C23H12F2O4/c24-15-8-6-13(19(25)10-15)7-9-16-17-11-18(23(27)28)20(26)12-21(17)29-22(16)14-4-2-1-3-5-14/h1-6,8,10-12,26H,(H,27,28)
Reactome pathway
n/an/a 3.90E+3n/an/an/an/an/an/a
Indiana University School of Medicine
Curated by ChEMBL
Assay Description
Inhibition of VHR (unknown origin) expressed in Escherichia coli using pNPP substrate after 5 mins by spectrophotometric analysis
J Med Chem 56: 832-42 (2013)
Article DOI: 10.1021/jm301781p
BindingDB Entry DOI: 10.7270/Q2KK9D4X
Leukocyte common antigen
(Homo sapiens (Human))
BDBM50425816
(CHEMBL2316910)
Show SMILES OC(=O)c1cc2c(C#Cc3ccc(F)cc3F)c(oc2cc1O)-c1ccccc1
Show InChI InChI=1S/C23H12F2O4/c24-15-8-6-13(19(25)10-15)7-9-16-17-11-18(23(27)28)20(26)12-21(17)29-22(16)14-4-2-1-3-5-14/h1-6,8,10-12,26H,(H,27,28)
Reactome pathway
n/an/a 5.50E+3n/an/an/an/an/an/a
Indiana University School of Medicine
Curated by ChEMBL
Assay Description
Inhibition of CD45 (unknown origin) expressed in Escherichia coli using pNPP substrate after 5 mins by spectrophotometric analysis
J Med Chem 56: 832-42 (2013)
Article DOI: 10.1021/jm301781p
BindingDB Entry DOI: 10.7270/Q2KK9D4X
Protein-tyrosine phosphatase MEG2 (PTP-Meg2)
(Homo sapiens (Human))
BDBM50425816
(CHEMBL2316910)
Show SMILES OC(=O)c1cc2c(C#Cc3ccc(F)cc3F)c(oc2cc1O)-c1ccccc1
Show InChI InChI=1S/C23H12F2O4/c24-15-8-6-13(19(25)10-15)7-9-16-17-11-18(23(27)28)20(26)12-21(17)29-22(16)14-4-2-1-3-5-14/h1-6,8,10-12,26H,(H,27,28)
n/an/a 4.80E+3n/an/an/an/an/an/a
Indiana University School of Medicine
Curated by ChEMBL
Assay Description
Inhibition of PTPMEG2 (unknown origin) expressed in Escherichia coli using pNPP substrate after 5 mins by spectrophotometric analysis
J Med Chem 56: 832-42 (2013)
Article DOI: 10.1021/jm301781p
BindingDB Entry DOI: 10.7270/Q2KK9D4X
Hematopoietic cell protein-tyrosine phosphatase 70Z-PEP
(Homo sapiens (Human))
BDBM50425816
(CHEMBL2316910)
Show SMILES OC(=O)c1cc2c(C#Cc3ccc(F)cc3F)c(oc2cc1O)-c1ccccc1
Show InChI InChI=1S/C23H12F2O4/c24-15-8-6-13(19(25)10-15)7-9-16-17-11-18(23(27)28)20(26)12-21(17)29-22(16)14-4-2-1-3-5-14/h1-6,8,10-12,26H,(H,27,28)
n/an/a 3.50E+3n/an/an/an/an/an/a
Indiana University School of Medicine
Curated by ChEMBL
Assay Description
Inhibition of LYP (unknown origin) expressed in Escherichia coli using pNPP substrate after 5 mins by spectrophotometric analysis
J Med Chem 56: 832-42 (2013)
Article DOI: 10.1021/jm301781p
BindingDB Entry DOI: 10.7270/Q2KK9D4X
Hematopoietic cell protein-tyrosine phosphatase 70Z-PEP
(Homo sapiens (Human))
BDBM50425816
(CHEMBL2316910)
Show SMILES OC(=O)c1cc2c(C#Cc3ccc(F)cc3F)c(oc2cc1O)-c1ccccc1
Show InChI InChI=1S/C23H12F2O4/c24-15-8-6-13(19(25)10-15)7-9-16-17-11-18(23(27)28)20(26)12-21(17)29-22(16)14-4-2-1-3-5-14/h1-6,8,10-12,26H,(H,27,28)
n/an/a 3.50E+3n/an/an/an/an/an/a
Indiana University School of Medicine
Curated by ChEMBL
Assay Description
Inhibition of N-terminal 6xHis-tagged LYP catalytic domain (1 to 303) (unknown origin) expressed in Escherichia coli BL21(DE3) using pNPP as substrat...
J Med Chem 56: 4990-5008 (2013)
Article DOI: 10.1021/jm400248c
BindingDB Entry DOI: 10.7270/Q2N017XW
Protein-tyrosine phosphatase 1C
(Homo sapiens (Human))
BDBM50425816
(CHEMBL2316910)
Show SMILES OC(=O)c1cc2c(C#Cc3ccc(F)cc3F)c(oc2cc1O)-c1ccccc1
Show InChI InChI=1S/C23H12F2O4/c24-15-8-6-13(19(25)10-15)7-9-16-17-11-18(23(27)28)20(26)12-21(17)29-22(16)14-4-2-1-3-5-14/h1-6,8,10-12,26H,(H,27,28)
Reactome pathway
n/an/a 2.60E+3n/an/an/an/an/an/a
Indiana University School of Medicine
Curated by ChEMBL
Assay Description
Inhibition of SHP1 (unknown origin) expressed in Escherichia coli using pNPP substrate after 5 mins by spectrophotometric analysis
J Med Chem 56: 832-42 (2013)
Article DOI: 10.1021/jm301781p
BindingDB Entry DOI: 10.7270/Q2KK9D4X
Tyrosine-protein phosphatase non-receptor type 2
(Homo sapiens (Human))
BDBM50425816
(CHEMBL2316910)
Show SMILES OC(=O)c1cc2c(C#Cc3ccc(F)cc3F)c(oc2cc1O)-c1ccccc1
Show InChI InChI=1S/C23H12F2O4/c24-15-8-6-13(19(25)10-15)7-9-16-17-11-18(23(27)28)20(26)12-21(17)29-22(16)14-4-2-1-3-5-14/h1-6,8,10-12,26H,(H,27,28)
n/an/a 9.00E+4n/an/an/an/an/an/a
Indiana University School of Medicine
Curated by ChEMBL
Assay Description
Inhibition of TCPTP (unknown origin) expressed in Escherichia coli using pNPP substrate after 5 mins by spectrophotometric analysis
J Med Chem 56: 832-42 (2013)
Article DOI: 10.1021/jm301781p
BindingDB Entry DOI: 10.7270/Q2KK9D4X
Protein-tyrosine phosphatase 1B
(Homo sapiens (Human))
BDBM50425816
(CHEMBL2316910)
Show SMILES OC(=O)c1cc2c(C#Cc3ccc(F)cc3F)c(oc2cc1O)-c1ccccc1
Show InChI InChI=1S/C23H12F2O4/c24-15-8-6-13(19(25)10-15)7-9-16-17-11-18(23(27)28)20(26)12-21(17)29-22(16)14-4-2-1-3-5-14/h1-6,8,10-12,26H,(H,27,28)
NCI pathway
Reactome pathway
n/an/a 5.20E+3n/an/an/an/an/an/a
Indiana University School of Medicine
Curated by ChEMBL
Assay Description
Inhibition of PTP1B (unknown origin) expressed in Escherichia coli using pNPP substrate after 5 mins by spectrophotometric analysis
J Med Chem 56: 832-42 (2013)
Article DOI: 10.1021/jm301781p
BindingDB Entry DOI: 10.7270/Q2KK9D4X
Tyrosine-protein phosphatase non-receptor type 11
(Homo sapiens (Human))
BDBM50425816
(CHEMBL2316910)
Show SMILES OC(=O)c1cc2c(C#Cc3ccc(F)cc3F)c(oc2cc1O)-c1ccccc1
Show InChI InChI=1S/C23H12F2O4/c24-15-8-6-13(19(25)10-15)7-9-16-17-11-18(23(27)28)20(26)12-21(17)29-22(16)14-4-2-1-3-5-14/h1-6,8,10-12,26H,(H,27,28)
NCI pathway
Reactome pathway
n/an/a 2.83E+3n/an/an/an/an/an/a
Indiana University School of Medicine
Curated by ChEMBL
Assay Description
Inhibition of SHP2 (unknown origin) expressed in Escherichia coli using pNPP substrate after 5 mins by spectrophotometric analysis
J Med Chem 56: 832-42 (2013)
Article DOI: 10.1021/jm301781p
BindingDB Entry DOI: 10.7270/Q2KK9D4X