BDBM50425825 CHEMBL2312306
SMILES: O=C(NCCCN1CCCC1=O)c1cnc(NCCc2cccnc2)nc1Nc1ccccc1
InChI Key: InChIKey=UKLIHEWNGMQBIZ-UHFFFAOYSA-N
Data: 1 IC50
Activity Spreadsheet -- Enzyme Inhibition Constant Data from BindingDB
Found 1 hit for monomerid = 50425825
Trg + Lig
Ki
nM
ΔG°
kcal/mole
IC50
nM
Kd
nM
EC50/IC50
nM
koff
s-1
kon
M-1s-1
pHTemp
°C
Tyrosine-protein kinase receptor TYRO3
(Homo sapiens (Human))
BDBM50425825
(CHEMBL2312306)
Show SMILES O=C(NCCCN1CCCC1=O)c1cnc(NCCc2cccnc2)nc1Nc1ccccc1
Show InChI InChI=1S/C25H29N7O2/c33-22-10-5-15-32(22)16-6-13-27-24(34)21-18-29-25(28-14-11-19-7-4-12-26-17-19)31-23(21)30-20-8-2-1-3-9-20/h1-4,7-9,12,17-18H,5-6,10-11,13-16H2,(H,27,34)(H2,28,29,30,31)
n/an/a 4.20E+3n/an/an/an/an/an/a
Pfizer Inc.
Curated by ChEMBL
Assay Description
Inhibition of Sky (unknown origin) in presence of 60 uM ATP by ELISA
Bioorg Med Chem Lett 23: 1046-50 (2013)
Article DOI: 10.1016/j.bmcl.2012.12.013
BindingDB Entry DOI: 10.7270/Q26D5V9W