BDBM50425867 CHEMBL2312656
SMILES: O[C@@H]1COC[C@H]1Nc1nc(Nc2cc(Cl)cc(Cl)c2)ncc1-c1ccc(F)cc1
InChI Key: InChIKey=SILARZJSHLLLPY-QZTJIDSGSA-N
Data: 2 IC50
Activity Spreadsheet -- Enzyme Inhibition Constant Data from BindingDB
Found 2 hits for monomerid = 50425867
Trg + Lig
Ki
nM
ΔG°
kcal/mole
IC50
nM
Kd
nM
EC50/IC50
nM
koff
s-1
kon
M-1s-1
pHTemp
°C
Tyrosine-protein kinase receptor TYRO3
(Homo sapiens (Human))
BDBM50425867
(CHEMBL2312656)
Show SMILES O[C@@H]1COC[C@H]1Nc1nc(Nc2cc(Cl)cc(Cl)c2)ncc1-c1ccc(F)cc1 |r|
Show InChI InChI=1S/C20H17Cl2FN4O2/c21-12-5-13(22)7-15(6-12)25-20-24-8-16(11-1-3-14(23)4-2-11)19(27-20)26-17-9-29-10-18(17)28/h1-8,17-18,28H,9-10H2,(H2,24,25,26,27)/t17-,18-/m1/s1
n/an/a 150n/an/an/an/an/an/a
Pfizer Inc.
Curated by ChEMBL
Assay Description
Inhibition of Sky (unknown origin) by ELISA kinase assay in presence of 60 uM ATP
Bioorg Med Chem Lett 23: 1051-5 (2013)
Article DOI: 10.1016/j.bmcl.2012.12.028
BindingDB Entry DOI: 10.7270/Q2XW4M38
P-selectin/P-selectin glycoprotein ligand 1
(Homo sapiens (Human))
BDBM50425867
(CHEMBL2312656)
Show SMILES O[C@@H]1COC[C@H]1Nc1nc(Nc2cc(Cl)cc(Cl)c2)ncc1-c1ccc(F)cc1 |r|
Show InChI InChI=1S/C20H17Cl2FN4O2/c21-12-5-13(22)7-15(6-12)25-20-24-8-16(11-1-3-14(23)4-2-11)19(27-20)26-17-9-29-10-18(17)28/h1-8,17-18,28H,9-10H2,(H2,24,25,26,27)/t17-,18-/m1/s1
NCI pathway
Reactome pathway
n/an/a>8.00E+4n/an/an/an/an/an/a
Pfizer Inc.
Curated by ChEMBL
Assay Description
Inhibition of P-selectin aggregation in platelet surface (unknown origin)
Bioorg Med Chem Lett 23: 1051-5 (2013)
Article DOI: 10.1016/j.bmcl.2012.12.028
BindingDB Entry DOI: 10.7270/Q2XW4M38