BDBM50425871 CHEMBL2312651
SMILES: CN1CCC(CC1)NC(=O)c1cnc(Nc2cc(Cl)cc(Cl)c2)nc1N[C@H]1CCCCNC1=O
InChI Key: InChIKey=XGMASFFIBAMSSU-IBGZPJMESA-N
Data: 2 IC50
Activity Spreadsheet -- Enzyme Inhibition Constant Data from BindingDB
Found 2 hits for monomerid = 50425871
Trg + Lig
Ki
nM
ΔG°
kcal/mole
IC50
nM
Kd
nM
EC50/IC50
nM
koff
s-1
kon
M-1s-1
pHTemp
°C
Tyrosine-protein kinase receptor TYRO3
(Homo sapiens (Human))
BDBM50425871
(CHEMBL2312651)
Show SMILES CN1CCC(CC1)NC(=O)c1cnc(Nc2cc(Cl)cc(Cl)c2)nc1N[C@H]1CCCCNC1=O |r|
Show InChI InChI=1S/C23H29Cl2N7O2/c1-32-8-5-16(6-9-32)28-21(33)18-13-27-23(29-17-11-14(24)10-15(25)12-17)31-20(18)30-19-4-2-3-7-26-22(19)34/h10-13,16,19H,2-9H2,1H3,(H,26,34)(H,28,33)(H2,27,29,30,31)/t19-/m0/s1
n/an/a 6n/an/an/an/an/an/a
Pfizer Inc.
Curated by ChEMBL
Assay Description
Inhibition of Sky (unknown origin) by ELISA kinase assay in presence of 60 uM ATP
Bioorg Med Chem Lett 23: 1051-5 (2013)
Article DOI: 10.1016/j.bmcl.2012.12.028
BindingDB Entry DOI: 10.7270/Q2XW4M38
P-selectin/P-selectin glycoprotein ligand 1
(Homo sapiens (Human))
BDBM50425871
(CHEMBL2312651)
Show SMILES CN1CCC(CC1)NC(=O)c1cnc(Nc2cc(Cl)cc(Cl)c2)nc1N[C@H]1CCCCNC1=O |r|
Show InChI InChI=1S/C23H29Cl2N7O2/c1-32-8-5-16(6-9-32)28-21(33)18-13-27-23(29-17-11-14(24)10-15(25)12-17)31-20(18)30-19-4-2-3-7-26-22(19)34/h10-13,16,19H,2-9H2,1H3,(H,26,34)(H,28,33)(H2,27,29,30,31)/t19-/m0/s1
NCI pathway
Reactome pathway
n/an/a 430n/an/an/an/an/an/a
Pfizer Inc.
Curated by ChEMBL
Assay Description
Inhibition of P-selectin aggregation in platelet surface (unknown origin)
Bioorg Med Chem Lett 23: 1051-5 (2013)
Article DOI: 10.1016/j.bmcl.2012.12.028
BindingDB Entry DOI: 10.7270/Q2XW4M38