BDBM50425911 CHEMBL2313700
SMILES: Fc1ccc2c(noc2c1)C1CCN(CC1)C(=O)C1CCCN1C(=S)Nc1cccc(Br)c1
InChI Key: InChIKey=VBGZUYDSHYQTHB-UHFFFAOYSA-N
Data: 1 IC50
Activity Spreadsheet -- Enzyme Inhibition Constant Data from BindingDB
Found 1 hit for monomerid = 50425911
Trg + Lig
Ki
nM
ΔG°
kcal/mole
IC50
nM
Kd
nM
EC50/IC50
nM
koff
s-1
kon
M-1s-1
pHTemp
°C
Serum albumin
(Bos taurus)
BDBM50425911
(CHEMBL2313700)
Show SMILES Fc1ccc2c(noc2c1)C1CCN(CC1)C(=O)C1CCCN1C(=S)Nc1cccc(Br)c1
Show InChI InChI=1S/C24H24BrFN4O2S/c25-16-3-1-4-18(13-16)27-24(33)30-10-2-5-20(30)23(31)29-11-8-15(9-12-29)22-19-7-6-17(26)14-21(19)32-28-22/h1,3-4,6-7,13-15,20H,2,5,8-12H2,(H,27,33)
Reactome pathway
n/an/a 4.70E+3n/an/an/an/an/an/a
University of Mysore
Curated by ChEMBL
Assay Description
Inhibition of glycation of bovine serum albumin assessed as advanced glycated end product measured after 7 days by spectrofluorimeter in presence of ...
Eur J Med Chem 60: 325-32 (2013)
Article DOI: 10.1016/j.ejmech.2012.12.029
BindingDB Entry DOI: 10.7270/Q2JQ1292