BDBM50425933 CHEMBL2313728
SMILES: Fc1ccc2c(noc2c1)C1CCN(CC1)C(=O)CNC(=O)Nc1cccc(Br)c1
InChI Key: InChIKey=PAUKMCPCKOATTR-UHFFFAOYSA-N
Data: 1 IC50
Activity Spreadsheet -- Enzyme Inhibition Constant Data from BindingDB
Found 1 hit for monomerid = 50425933
Trg + Lig
Ki
nM
ΔG°
kcal/mole
IC50
nM
Kd
nM
EC50/IC50
nM
koff
s-1
kon
M-1s-1
pHTemp
°C
Serum albumin
(Bos taurus)
BDBM50425933
(CHEMBL2313728)
Show SMILES Fc1ccc2c(noc2c1)C1CCN(CC1)C(=O)CNC(=O)Nc1cccc(Br)c1
Show InChI InChI=1S/C21H20BrFN4O3/c22-14-2-1-3-16(10-14)25-21(29)24-12-19(28)27-8-6-13(7-9-27)20-17-5-4-15(23)11-18(17)30-26-20/h1-5,10-11,13H,6-9,12H2,(H2,24,25,29)
Reactome pathway
n/an/a 9.30E+3n/an/an/an/an/an/a
University of Mysore
Curated by ChEMBL
Assay Description
Inhibition of glycation of bovine serum albumin assessed as advanced glycated end product measured after 7 days by spectrofluorimeter in presence of ...
Eur J Med Chem 60: 325-32 (2013)
Article DOI: 10.1016/j.ejmech.2012.12.029
BindingDB Entry DOI: 10.7270/Q2JQ1292