BDBM50425952 CHEMBL2314379
SMILES: Nc1ccc(Sc2c[nH]c(=O)c(c2)C#N)cc1
InChI Key: InChIKey=RGGRIUTUDQNGSD-UHFFFAOYSA-N
Data: 1 KI  1 IC50
Activity Spreadsheet -- Enzyme Inhibition Constant Data from BindingDB
Found 2 hits for monomerid = 50425952
Trg + Lig
Ki
nM
ΔG°
kcal/mole
IC50
nM
Kd
nM
EC50/IC50
nM
koff
s-1
kon
M-1s-1
pHTemp
°C
Induced myeloid leukemia cell differentiation protein Mcl-1
(Homo sapiens (Human))
BDBM50425952
(CHEMBL2314379)
Show SMILES Nc1ccc(Sc2c[nH]c(=O)c(c2)C#N)cc1
Show InChI InChI=1S/C12H9N3OS/c13-6-8-5-11(7-15-12(8)16)17-10-3-1-9(14)2-4-10/h1-5,7H,14H2,(H,15,16)
NCI pathway
5.31E+3n/an/an/an/an/an/an/an/a
Dalian University of Technology
Curated by ChEMBL
Assay Description
Inhibition of FAM-Bid peptide binding to Mcl1 (unknown origin) expressed in Escherichia coli BL21 by fluorescence polarization-based binding assay
Eur J Med Chem 60: 410-20 (2013)
Article DOI: 10.1016/j.ejmech.2012.12.016
BindingDB Entry DOI: 10.7270/Q2959JVC
Induced myeloid leukemia cell differentiation protein Mcl-1
(Homo sapiens (Human))
BDBM50425952
(CHEMBL2314379)
Show SMILES Nc1ccc(Sc2c[nH]c(=O)c(c2)C#N)cc1
Show InChI InChI=1S/C12H9N3OS/c13-6-8-5-11(7-15-12(8)16)17-10-3-1-9(14)2-4-10/h1-5,7H,14H2,(H,15,16)
NCI pathway
n/an/a 1.33E+5n/an/an/an/an/an/a
Dalian University of Technology
Curated by ChEMBL
Assay Description
Inhibition of FAM-Bid peptide binding to Mcl1 (unknown origin) expressed in Escherichia coli BL21 by fluorescence polarization-based binding assay
Eur J Med Chem 60: 410-20 (2013)
Article DOI: 10.1016/j.ejmech.2012.12.016
BindingDB Entry DOI: 10.7270/Q2959JVC