BDBM50426068 2-(Cyclohexyldisulfanyl)Benzo[D]Thiazole::CHEMBL2315299
SMILES: C1CCC(CC1)SSc1nc2ccccc2s1
InChI Key: InChIKey=BUHXQMMNPJACLC-UHFFFAOYSA-N
Data: 1 IC50
Activity Spreadsheet -- Enzyme Inhibition Constant Data from BindingDB
Found 1 hit for monomerid = 50426068
Trg + Lig
Ki
nM
ΔG°
kcal/mole
IC50
nM
Kd
nM
EC50/IC50
nM
koff
s-1
kon
M-1s-1
pHTemp
°C
Thioredoxin
(Homo sapiens (Human))
BDBM50426068
(2-(Cyclohexyldisulfanyl)Benzo[D]Thiazole | CHEMBL2...)
Show SMILES C1CCC(CC1)SSc1nc2ccccc2s1
Show InChI InChI=1S/C13H15NS3/c1-2-6-10(7-3-1)16-17-13-14-11-8-4-5-9-12(11)15-13/h4-5,8-10H,1-3,6-7H2
Reactome pathway
n/an/a 510n/an/an/an/an/an/a
Stanford University
Curated by ChEMBL
Assay Description
Inhibition of human recombinant thioredoxin-mediated TG2 activation expressed in T84 cells assessed as blockade of 5-biotinamidopentylamine incorpora...
J Med Chem 56: 1301-10 (2013)
Article DOI: 10.1021/jm301775s
BindingDB Entry DOI: 10.7270/Q2HQ4181