BDBM50426312 CHEMBL2321951
SMILES: COC(=O)c1ccc2[nH]c(C3C(=O)Nc4ccccc34)c(N=O)c2c1
InChI Key: InChIKey=YKNBZWQTFVBMQX-UHFFFAOYSA-N
Data: 5 IC50
Activity Spreadsheet -- Enzyme Inhibition Constant Data from BindingDB
Found 5 hits for monomerid = 50426312
Trg + Lig
Ki
nM
ΔG°
kcal/mole
IC50
nM
Kd
nM
EC50/IC50
nM
koff
s-1
kon
M-1s-1
pHTemp
°C
Dual-specificity tyrosine-phosphorylation regulated kinase 2
(Homo sapiens (Human))
BDBM50426312
(CHEMBL2321951)
Show SMILES COC(=O)c1ccc2[nH]c(C3C(=O)Nc4ccccc34)c(N=O)c2c1
Show InChI InChI=1S/C18H13N3O4/c1-25-18(23)9-6-7-13-11(8-9)15(21-24)16(19-13)14-10-4-2-3-5-12(10)20-17(14)22/h2-8,14,19H,1H3,(H,20,22)
NCI pathway
n/an/a>1.00E+3n/an/an/an/an/an/a
University of Athens
Curated by ChEMBL
Assay Description
Inhibition of human recombinant GST-fused DYRK2 expressed in Escherichia coli using KKISGRLSPIMTEQ as substrate after 30 mins by scintillation counti...
ACS Med Chem Lett 4: 22-26 (2013)
Article DOI: 10.1021/ml300207a
BindingDB Entry DOI: 10.7270/Q2Q81FD1
Dual-specificity tyrosine-(Y)-phosphorylation regulated kinase 1A
(RAT)
BDBM50426312
(CHEMBL2321951)
Show SMILES COC(=O)c1ccc2[nH]c(C3C(=O)Nc4ccccc34)c(N=O)c2c1
Show InChI InChI=1S/C18H13N3O4/c1-25-18(23)9-6-7-13-11(8-9)15(21-24)16(19-13)14-10-4-2-3-5-12(10)20-17(14)22/h2-8,14,19H,1H3,(H,20,22)
n/an/a>1.00E+4n/an/an/an/an/an/a
University of Athens
Curated by ChEMBL
Assay Description
Inhibition of rat recombinant GST-fused DYRK1A expressed in Escherichia coli using KKISGRLSPIMTEQ as substrate after 30 mins by scintillation countin...
ACS Med Chem Lett 4: 22-26 (2013)
Article DOI: 10.1021/ml300207a
BindingDB Entry DOI: 10.7270/Q2Q81FD1
Cyclin-dependent-like kinase 5
(Homo sapiens (Human))
BDBM50426312
(CHEMBL2321951)
Show SMILES COC(=O)c1ccc2[nH]c(C3C(=O)Nc4ccccc34)c(N=O)c2c1
Show InChI InChI=1S/C18H13N3O4/c1-25-18(23)9-6-7-13-11(8-9)15(21-24)16(19-13)14-10-4-2-3-5-12(10)20-17(14)22/h2-8,14,19H,1H3,(H,20,22)
NCI pathway
Reactome pathway
n/an/a 520n/an/an/an/an/an/a
University of Athens
Curated by ChEMBL
Assay Description
Inhibition of human recombinant CDK5
ACS Med Chem Lett 4: 22-26 (2013)
Article DOI: 10.1021/ml300207a
BindingDB Entry DOI: 10.7270/Q2Q81FD1
Glycogen synthase kinase-3
(Sus scrofa)
BDBM50426312
(CHEMBL2321951)
Show SMILES COC(=O)c1ccc2[nH]c(C3C(=O)Nc4ccccc34)c(N=O)c2c1
Show InChI InChI=1S/C18H13N3O4/c1-25-18(23)9-6-7-13-11(8-9)15(21-24)16(19-13)14-10-4-2-3-5-12(10)20-17(14)22/h2-8,14,19H,1H3,(H,20,22)
Reactome pathway
n/an/a 400n/an/an/an/an/an/a
University of Athens
Curated by ChEMBL
Assay Description
Inhibition of porcine brain GSK3beta using YRRAAVPPSPSLSRHSSPHQSpEDEEE as substrate
ACS Med Chem Lett 4: 22-26 (2013)
Article DOI: 10.1021/ml300207a
BindingDB Entry DOI: 10.7270/Q2Q81FD1
Casein kinase I isoform alpha
(Sus scrofa)
BDBM50426312
(CHEMBL2321951)
Show SMILES COC(=O)c1ccc2[nH]c(C3C(=O)Nc4ccccc34)c(N=O)c2c1
Show InChI InChI=1S/C18H13N3O4/c1-25-18(23)9-6-7-13-11(8-9)15(21-24)16(19-13)14-10-4-2-3-5-12(10)20-17(14)22/h2-8,14,19H,1H3,(H,20,22)
n/an/a 300n/an/an/an/an/an/a
University of Athens
Curated by ChEMBL
Assay Description
Inhibition of porcine brain CK1 using RRKHAAIGpSAYSITA as substrate
ACS Med Chem Lett 4: 22-26 (2013)
Article DOI: 10.1021/ml300207a
BindingDB Entry DOI: 10.7270/Q2Q81FD1