BDBM50426330 CHEMBL2321974
SMILES: OC(=O)c1ccc2C(=O)\C(Nc2c1)=C1\C(=O)Nc2ccccc12
InChI Key: InChIKey=LNVAEYFLLJIDOZ-YPKPFQOOSA-N
Data: 5 IC50
Activity Spreadsheet -- Enzyme Inhibition Constant Data from BindingDB
Found 5 hits for monomerid = 50426330
Trg + Lig
Ki
nM
ΔG°
kcal/mole
IC50
nM
Kd
nM
EC50/IC50
nM
koff
s-1
kon
M-1s-1
pHTemp
°C
Dual-specificity tyrosine-(Y)-phosphorylation regulated kinase 1A
(RAT)
BDBM50426330
(CHEMBL2321974)
Show SMILES OC(=O)c1ccc2C(=O)\C(Nc2c1)=C1\C(=O)Nc2ccccc12
Show InChI InChI=1S/C17H10N2O4/c20-15-10-6-5-8(17(22)23)7-12(10)18-14(15)13-9-3-1-2-4-11(9)19-16(13)21/h1-7,18H,(H,19,21)(H,22,23)/b14-13-
n/an/a 2.60E+3n/an/an/an/an/an/a
University of Athens
Curated by ChEMBL
Assay Description
Inhibition of rat recombinant GST-fused DYRK1A expressed in Escherichia coli using KKISGRLSPIMTEQ as substrate after 30 mins by scintillation countin...
ACS Med Chem Lett 4: 22-26 (2013)
Article DOI: 10.1021/ml300207a
BindingDB Entry DOI: 10.7270/Q2Q81FD1
Casein kinase I isoform alpha
(Sus scrofa)
BDBM50426330
(CHEMBL2321974)
Show SMILES OC(=O)c1ccc2C(=O)\C(Nc2c1)=C1\C(=O)Nc2ccccc12
Show InChI InChI=1S/C17H10N2O4/c20-15-10-6-5-8(17(22)23)7-12(10)18-14(15)13-9-3-1-2-4-11(9)19-16(13)21/h1-7,18H,(H,19,21)(H,22,23)/b14-13-
n/an/a 1.70E+3n/an/an/an/an/an/a
University of Athens
Curated by ChEMBL
Assay Description
Inhibition of porcine brain CK1 using RRKHAAIGpSAYSITA as substrate
ACS Med Chem Lett 4: 22-26 (2013)
Article DOI: 10.1021/ml300207a
BindingDB Entry DOI: 10.7270/Q2Q81FD1
Dual-specificity tyrosine-phosphorylation regulated kinase 2
(Homo sapiens (Human))
BDBM50426330
(CHEMBL2321974)
Show SMILES OC(=O)c1ccc2C(=O)\C(Nc2c1)=C1\C(=O)Nc2ccccc12
Show InChI InChI=1S/C17H10N2O4/c20-15-10-6-5-8(17(22)23)7-12(10)18-14(15)13-9-3-1-2-4-11(9)19-16(13)21/h1-7,18H,(H,19,21)(H,22,23)/b14-13-
NCI pathway
n/an/a 1.10E+3n/an/an/an/an/an/a
University of Athens
Curated by ChEMBL
Assay Description
Inhibition of human recombinant GST-fused DYRK2 expressed in Escherichia coli using KKISGRLSPIMTEQ as substrate after 30 mins by scintillation counti...
ACS Med Chem Lett 4: 22-26 (2013)
Article DOI: 10.1021/ml300207a
BindingDB Entry DOI: 10.7270/Q2Q81FD1
Cyclin-dependent-like kinase 5
(Homo sapiens (Human))
BDBM50426330
(CHEMBL2321974)
Show SMILES OC(=O)c1ccc2C(=O)\C(Nc2c1)=C1\C(=O)Nc2ccccc12
Show InChI InChI=1S/C17H10N2O4/c20-15-10-6-5-8(17(22)23)7-12(10)18-14(15)13-9-3-1-2-4-11(9)19-16(13)21/h1-7,18H,(H,19,21)(H,22,23)/b14-13-
NCI pathway
Reactome pathway
n/an/a>1.00E+4n/an/an/an/an/an/a
University of Athens
Curated by ChEMBL
Assay Description
Inhibition of human recombinant CDK5
ACS Med Chem Lett 4: 22-26 (2013)
Article DOI: 10.1021/ml300207a
BindingDB Entry DOI: 10.7270/Q2Q81FD1
Glycogen synthase kinase-3
(Sus scrofa)
BDBM50426330
(CHEMBL2321974)
Show SMILES OC(=O)c1ccc2C(=O)\C(Nc2c1)=C1\C(=O)Nc2ccccc12
Show InChI InChI=1S/C17H10N2O4/c20-15-10-6-5-8(17(22)23)7-12(10)18-14(15)13-9-3-1-2-4-11(9)19-16(13)21/h1-7,18H,(H,19,21)(H,22,23)/b14-13-
Reactome pathway
n/an/a>1.00E+4n/an/an/an/an/an/a
University of Athens
Curated by ChEMBL
Assay Description
Inhibition of porcine brain GSK3beta using YRRAAVPPSPSLSRHSSPHQSpEDEEE as substrate
ACS Med Chem Lett 4: 22-26 (2013)
Article DOI: 10.1021/ml300207a
BindingDB Entry DOI: 10.7270/Q2Q81FD1