BDBM50426447 CHEMBL2322358
SMILES: Cc1ccc(cc1C(=O)Nc1ccc(nc1)N1CCCC1)C(=O)N1CCC(CC1)c1ccc(cc1)C#N
InChI Key: InChIKey=GIYSHHNGMCOGPI-UHFFFAOYSA-N
Data: 3 IC50
Activity Spreadsheet -- Enzyme Inhibition Constant Data from BindingDB
Found 3 hits for monomerid = 50426447
Trg + Lig
Ki
nM
ΔG°
kcal/mole
IC50
nM
Kd
nM
EC50/IC50
nM
koff
s-1
kon
M-1s-1
pHTemp
°C
Fatty acid synthase
(Homo sapiens (Human))
BDBM50426447
(CHEMBL2322358)
Show SMILES Cc1ccc(cc1C(=O)Nc1ccc(nc1)N1CCCC1)C(=O)N1CCC(CC1)c1ccc(cc1)C#N
Show InChI InChI=1S/C30H31N5O2/c1-21-4-7-25(30(37)35-16-12-24(13-17-35)23-8-5-22(19-31)6-9-23)18-27(21)29(36)33-26-10-11-28(32-20-26)34-14-2-3-15-34/h4-11,18,20,24H,2-3,12-17H2,1H3,(H,33,36)
US Patent
n/an/a 35n/an/an/an/an/an/a
3-V Biosciences, Inc.
US Patent
Assay Description
The FASN enzyme was isolated from SKBr3 cells. SKBr3 is a human breast cancer cell-line with high levels of FASN expression. It is estimated that FAS...
US Patent US8871790 (2014)
BindingDB Entry DOI: 10.7270/Q2PG1QD3
Fatty acid synthase
(Homo sapiens (Human))
BDBM50426447
(CHEMBL2322358)
Show SMILES Cc1ccc(cc1C(=O)Nc1ccc(nc1)N1CCCC1)C(=O)N1CCC(CC1)c1ccc(cc1)C#N
Show InChI InChI=1S/C30H31N5O2/c1-21-4-7-25(30(37)35-16-12-24(13-17-35)23-8-5-22(19-31)6-9-23)18-27(21)29(36)33-26-10-11-28(32-20-26)34-14-2-3-15-34/h4-11,18,20,24H,2-3,12-17H2,1H3,(H,33,36)
n/an/a 35n/an/an/an/an/an/a
3-V Biosciences, Inc.
Curated by ChEMBL
Assay Description
Inhibition of human FASN assessed as release of co-enzyme A
ACS Med Chem Lett 4: 113-7 (2013)
Article DOI: 10.1021/ml300335r
BindingDB Entry DOI: 10.7270/Q2P84D76
Fatty acid synthase
(Rattus norvegicus)
BDBM50426447
(CHEMBL2322358)
Show SMILES Cc1ccc(cc1C(=O)Nc1ccc(nc1)N1CCCC1)C(=O)N1CCC(CC1)c1ccc(cc1)C#N
Show InChI InChI=1S/C30H31N5O2/c1-21-4-7-25(30(37)35-16-12-24(13-17-35)23-8-5-22(19-31)6-9-23)18-27(21)29(36)33-26-10-11-28(32-20-26)34-14-2-3-15-34/h4-11,18,20,24H,2-3,12-17H2,1H3,(H,33,36)
Reactome pathway
n/an/a 2.85E+4n/an/an/an/an/an/a
3-V Biosciences, Inc.
Curated by ChEMBL
Assay Description
Inhibition of rat FASN assessed as release of co-enzyme A
ACS Med Chem Lett 4: 113-7 (2013)
Article DOI: 10.1021/ml300335r
BindingDB Entry DOI: 10.7270/Q2P84D76