BDBM50426570 CHEMBL2324344
SMILES: CCCC(=O)C1CCN(CC1)c1ncnc2CCN(Cc12)C(=O)c1ccc(cc1)-c1ccccc1
InChI Key: InChIKey=CJZGRIRZVHNUSM-UHFFFAOYSA-N
Data: 7 IC50
Activity Spreadsheet -- Enzyme Inhibition Constant Data from BindingDB
Found 7 hits for monomerid = 50426570
Trg + Lig
Ki
nM
ΔG°
kcal/mole
IC50
nM
Kd
nM
EC50/IC50
nM
koff
s-1
kon
M-1s-1
pHTemp
°C
Potassium channel protein TASK-1
(Homo sapiens (Human))
BDBM50426570
(CHEMBL2324344)
Show SMILES CCCC(=O)C1CCN(CC1)c1ncnc2CCN(Cc12)C(=O)c1ccc(cc1)-c1ccccc1
Show InChI InChI=1S/C29H32N4O2/c1-2-6-27(34)23-13-16-32(17-14-23)28-25-19-33(18-15-26(25)30-20-31-28)29(35)24-11-9-22(10-12-24)21-7-4-3-5-8-21/h3-5,7-12,20,23H,2,6,13-19H2,1H3
n/an/a 300n/an/an/an/an/an/a
University of Kansas Specialized Chemistry Center
Curated by ChEMBL
Assay Description
Inhibition of TASK-1 (unknown origin) expressed in CHO cells by thallium flux assay
Bioorg Med Chem Lett 24: 3968-73 (2014)
Article DOI: 10.1016/j.bmcl.2014.06.032
BindingDB Entry DOI: 10.7270/Q2805487
Potassium channel subfamily K member 9
(Homo sapiens (Human))
BDBM50426570
(CHEMBL2324344)
Show SMILES CCCC(=O)C1CCN(CC1)c1ncnc2CCN(Cc12)C(=O)c1ccc(cc1)-c1ccccc1
Show InChI InChI=1S/C29H32N4O2/c1-2-6-27(34)23-13-16-32(17-14-23)28-25-19-33(18-15-26(25)30-20-31-28)29(35)24-11-9-22(10-12-24)21-7-4-3-5-8-21/h3-5,7-12,20,23H,2,6,13-19H2,1H3
Reactome pathway
n/an/a 35n/an/an/an/an/an/a
Pfizer Inc.
Curated by ChEMBL
Assay Description
Inhibition of TASK-3 (unknown origin)
J Med Chem 56: 593-624 (2013)
Article DOI: 10.1021/jm3011433
BindingDB Entry DOI: 10.7270/Q23B61GZ
Potassium channel protein TASK-1
(Homo sapiens (Human))
BDBM50426570
(CHEMBL2324344)
Show SMILES CCCC(=O)C1CCN(CC1)c1ncnc2CCN(Cc12)C(=O)c1ccc(cc1)-c1ccccc1
Show InChI InChI=1S/C29H32N4O2/c1-2-6-27(34)23-13-16-32(17-14-23)28-25-19-33(18-15-26(25)30-20-31-28)29(35)24-11-9-22(10-12-24)21-7-4-3-5-8-21/h3-5,7-12,20,23H,2,6,13-19H2,1H3
n/an/a 300n/an/an/an/an/an/a
Pfizer Inc.
Curated by ChEMBL
Assay Description
Inhibition of TASK-1 (unknown origin)
J Med Chem 56: 593-624 (2013)
Article DOI: 10.1021/jm3011433
BindingDB Entry DOI: 10.7270/Q23B61GZ
Potassium channel subfamily K member 9
(Homo sapiens (Human))
BDBM50426570
(CHEMBL2324344)
Show SMILES CCCC(=O)C1CCN(CC1)c1ncnc2CCN(Cc12)C(=O)c1ccc(cc1)-c1ccccc1
Show InChI InChI=1S/C29H32N4O2/c1-2-6-27(34)23-13-16-32(17-14-23)28-25-19-33(18-15-26(25)30-20-31-28)29(35)24-11-9-22(10-12-24)21-7-4-3-5-8-21/h3-5,7-12,20,23H,2,6,13-19H2,1H3
Reactome pathway
n/an/a 35n/an/an/an/an/an/a
Universidad de Talca
Curated by ChEMBL
Assay Description
Inhibition of human TASK3 expressed in HEK293 cells by Qpatch HT platform based assay
J Med Chem 62: 10044-10058 (2019)
Article DOI: 10.1021/acs.jmedchem.9b00248
Potassium channel subfamily K member 9
(Homo sapiens (Human))
BDBM50426570
(CHEMBL2324344)
Show SMILES CCCC(=O)C1CCN(CC1)c1ncnc2CCN(Cc12)C(=O)c1ccc(cc1)-c1ccccc1
Show InChI InChI=1S/C29H32N4O2/c1-2-6-27(34)23-13-16-32(17-14-23)28-25-19-33(18-15-26(25)30-20-31-28)29(35)24-11-9-22(10-12-24)21-7-4-3-5-8-21/h3-5,7-12,20,23H,2,6,13-19H2,1H3
Reactome pathway
n/an/a 243n/an/an/an/an/an/a
Universidad de Talca
Curated by ChEMBL
Assay Description
Inhibition of human TASK3 expressed in Xenopus oocytes by whole cell voltage clamp assay
J Med Chem 62: 10044-10058 (2019)
Article DOI: 10.1021/acs.jmedchem.9b00248
Potassium channel subfamily K member 9
(Rattus norvegicus)
BDBM50426570
(CHEMBL2324344)
Show SMILES CCCC(=O)C1CCN(CC1)c1ncnc2CCN(Cc12)C(=O)c1ccc(cc1)-c1ccccc1
Show InChI InChI=1S/C29H32N4O2/c1-2-6-27(34)23-13-16-32(17-14-23)28-25-19-33(18-15-26(25)30-20-31-28)29(35)24-11-9-22(10-12-24)21-7-4-3-5-8-21/h3-5,7-12,20,23H,2,6,13-19H2,1H3
Reactome pathway
n/an/a 10n/an/an/an/an/an/a
Universidad de Talca
Curated by ChEMBL
Assay Description
Inhibition of rat TASK3 expressed in (FRT) epithelial cells by chamber based electrophysiology assay
J Med Chem 62: 10044-10058 (2019)
Article DOI: 10.1021/acs.jmedchem.9b00248
Potassium channel protein TASK-1
(Homo sapiens (Human))
BDBM50426570
(CHEMBL2324344)
Show SMILES CCCC(=O)C1CCN(CC1)c1ncnc2CCN(Cc12)C(=O)c1ccc(cc1)-c1ccccc1
Show InChI InChI=1S/C29H32N4O2/c1-2-6-27(34)23-13-16-32(17-14-23)28-25-19-33(18-15-26(25)30-20-31-28)29(35)24-11-9-22(10-12-24)21-7-4-3-5-8-21/h3-5,7-12,20,23H,2,6,13-19H2,1H3
n/an/a 300n/an/an/an/an/an/a
Universidad de Talca
Curated by ChEMBL
Assay Description
Inhibition of human TASK1 expressed in HEK293 cells by Qpatch HT platform based assay
J Med Chem 62: 10044-10058 (2019)
Article DOI: 10.1021/acs.jmedchem.9b00248