BDBM50426642 CHEMBL459152
SMILES: O=C(Nc1noc2ccccc12)N1CCN(CC1)c1nc(ns1)-c1ccccc1
InChI Key: InChIKey=FXEXASVEXQCUMU-UHFFFAOYSA-N
Data: 2 IC50
Activity Spreadsheet -- Enzyme Inhibition Constant Data from BindingDB
Found 2 hits for monomerid = 50426642
Trg + Lig
Ki
nM
ΔG°
kcal/mole
IC50
nM
Kd
nM
EC50/IC50
nM
koff
s-1
kon
M-1s-1
pHTemp
°C
Fatty-acid amide hydrolase 1
(Homo sapiens (Human))
BDBM50426642
(CHEMBL459152)
Show SMILES O=C(Nc1noc2ccccc12)N1CCN(CC1)c1nc(ns1)-c1ccccc1
Show InChI InChI=1S/C20H18N6O2S/c27-19(21-18-15-8-4-5-9-16(15)28-23-18)25-10-12-26(13-11-25)20-22-17(24-29-20)14-6-2-1-3-7-14/h1-9H,10-13H2,(H,21,23,27)
n/an/a 4.80n/an/an/an/an/an/a
Takeda Pharmaceutical Company Ltd
Curated by ChEMBL
Assay Description
Apparent inhibition of human FAAH expressed in CHO-K1 cells using ethanolamine 1-3[H] as substrate after 30 mins by liquid scintillation counting
Bioorg Med Chem 21: 28-41 (2012)
Article DOI: 10.1016/j.bmc.2012.11.006
BindingDB Entry DOI: 10.7270/Q2FN17H6
Fatty-acid amide hydrolase 1 (aa 30-579)
(Rattus norvegicus (rat))
BDBM50426642
(CHEMBL459152)
Show SMILES O=C(Nc1noc2ccccc12)N1CCN(CC1)c1nc(ns1)-c1ccccc1
Show InChI InChI=1S/C20H18N6O2S/c27-19(21-18-15-8-4-5-9-16(15)28-23-18)25-10-12-26(13-11-25)20-22-17(24-29-20)14-6-2-1-3-7-14/h1-9H,10-13H2,(H,21,23,27)
n/an/a 5.5n/an/an/an/an/an/a
Takeda Pharmaceutical Company Ltd
Curated by ChEMBL
Assay Description
Apparent inhibition of rat FAAH after 30 mins
Bioorg Med Chem 21: 28-41 (2012)
Article DOI: 10.1016/j.bmc.2012.11.006
BindingDB Entry DOI: 10.7270/Q2FN17H6